{"text_format":"1","workbook":"xlsx","n_sheets":5,"sheets":["Disclaimer","Project&Typical Info","Surfacing Frame Quantities","Typical Section Quantities","Lookup Values"],"not_rendered":{"charts":0,"images":3,"macros":1,"external_links":0,"defined_names":1,"comments":0,"pivot_tables":0},"unopened":[],"bounds":{"document_bytes":16777216,"sheet_cells":100000,"rows_first":2000,"rows_last":500,"rows_between":2000,"halvings":0,"cell_chars":16384,"cell_head_chars":4096},"cells_cut":0,"cells_raw":0,"read":"whole","date_system":"1900"}

{"sheet":"Disclaimer","index":0,"n_rows":22,"n_cols":11,"rows_kept":22,"cut":false,"hidden":false,"merged":[[9,3,10,8],[11,3,25,8],[21,10,25,14]]}
[]
[]
[]
[]
[]
[]
[]
[]
[]
[null,null,null,"Disclaimer"]
[]
[null,null,null,"This Design Calculation Spreadsheet is provided \"as-is\" without warranty of any kind. The Montana Department of Transportation makes no representations or warranties whatsoever with respect to the accuracy or completeness of this tool and assumes no responsibility for the suitability of this tool for a particular purpose; and MDT will not be liable for any damages incurred as a result of errors in this tool. \n\nBy selecting Accept, you are agreeing to these terms and conditions."]
[]
[]
[]
[]
[]
[]
[]
[]
[]
[null,null,null,null,null,null,null,null,null,null,"WARNING: \nFor the tool to work properly, please make sure you click on \"Enable Content/Macros\" if the security warning appears."]

{"sheet":"Project&Typical Info","index":1,"n_rows":60,"n_cols":28,"rows_kept":60,"cut":false,"hidden":true,"merged":[[1,0,1,4],[3,0,3,4],[5,0,5,4],[6,0,6,4],[2,0,2,4],[36,7,37,12],[12,1,13,6],[12,7,13,12],[4,0,4,4],[7,0,7,4],[8,0,8,4]]}
["Project Information"]
["Asphalt Cement Content =",null,null,null,null,5.4,"%","Surfacing Design Activity 600 or RDM Appendix J, Pg 9"]
["Hydrated Lime =",null,null,null,null,1.4,"%","RDM Appendix J, Pg 9"]
["Comp. Weight of Aggregate =",null,null,null,null,3700,"lb/yd3","RDM Appendix J, Pg 9"]
["Comp. Weight of Plant Mix Bit. Surf. =",null,null,null,null,3855,"lb/yd3","RDM Appendix J, Pg 9"]
["Bituminous Material =",null,null,null,null,8.5,"lb/gal","RDM Appendix J, Pg 9"]
["Emulsified Asphalt - Tack (all other surf.)=",null,null,null,null,0.05,"gal/yd2","RDM Appendix J, Pg 9"]
["Emulsified Asphalt - Fog Seal (seal & cover) =",null,null,null,null,7.4999999999999997E-2,"gal/yd2","RDM Appendix J, Pg 9"]
["Seal =",null,null,null,null,0.42,"gal/yd2","RDM Appendix J, Pg 9"]
[]
[]
["Typical Section Information"]
[null,"Input for Symmetrical Typical Sections or                               Left Side for Unsymmetrical Typical Sections",null,null,null,null,null,"Input for Right Side on Unsymmetrical Typical Sections (Automated for Symmetrical Typical Sections)"]
[]
["Typical Section No.","Finished Surface Width LT. (ft)","Pl. Mix. Thickness LT. (ft)","Cr. Agg. Course Thickness LT. (ft)","Curb & Gutter LT. (Y or N)","Crown LT. (ft/ft)","Surfacing Inslope LT. (_:1)","Finished Surface Width RT. (ft)","Pl. Mix. Thickness RT. (ft)","Cr. Agg. Course Thickness RT. (ft)","Curb & Gutter RT. (Y or N)","Crown RT. (ft/ft)","Surfacing Inslope RT. (_:1)","Symmetrical (TRUE or FALSE)"]
[1,16,0.3,0.85,"N",0.02,6,{"$f":"B16","v":16},{"$f":"C16","v":0.3},{"$f":"D16","v":0.85},{"$f":"E16","v":"N"},{"$f":"F16","v":0.02},{"$f":"G16","v":6},{"$f":"AND(B16=H16,C16=I16,D16=J16,E16=K16,F16=L16,G16=M16)","v":true}]
[2,16,0.3,0.85,"N",-0.04,6,16,0.3,0.85,"N",0.04,6,false]
[3,null,null,null,null,null,null,0,0,0,0,0,0,true]
[4,null,null,null,null,null,null,0,0,0,0,0,0,true]
[5,null,null,null,null,null,null,0,0,0,0,0,0,true]
[6,null,null,null,null,null,null,0,0,0,0,0,0,true]
[7,null,null,null,null,null,null,0,0,0,0,0,0,true]
[8,null,null,null,null,null,null,0,0,0,0,0,0,true]
[9,null,null,null,null,null,null,0,0,0,0,0,0,true]
[10,null,null,null,null,null,null,0,0,0,0,0,0,true]
[11,null,null,null,null,null,null,0,0,0,0,0,0,true]
[12,null,null,null,null,null,null,0,0,0,0,0,0,true]
[13,null,null,null,null,null,null,0,0,0,0,0,0,true]
[14,null,null,null,null,null,null,0,0,0,0,0,0,true]
[15,null,null,null,null,null,null,0,0,0,0,0,0,true]
[16,null,null,null,null,null,null,0,0,0,0,0,0,true]
[17,null,null,null,null,null,null,0,0,0,0,0,0,true]
[18,null,null,null,null,null,null,0,0,0,0,0,0,true]
[19,null,null,null,null,null,null,0,0,0,0,0,0,true]
[20,null,null,null,null,null,null,0,0,0,0,0,0,true]
[]
[null,null,null,null,null,null,null,"NOTE: CELLS FILLED WITH THIS COLOR HAVE BEEN MODIFIED AND NEED TO BE RESET FOR SYMMETRICAL SECTIONS"]
[]
[]
["TYPICAL SECTION NO.","COVER (yd2/STA)","PLANT MIX (yd3/STA)","CRUSHED AGG. COURSE (yd3/STA)","PLANT MIX (T/STA)","CRUSHED AGG. COURSE (T/STA)","ASPHALT CEMENT (T/STA)","SEAL (T/STA)","AGG. TREAT. (yd2/STA)","EMULS. ASPHALT TACK (yd2/STA)","EMULS. ASPHALT TACK (gal/STA)","EMULS. ASPHALT FOG SEAL (gal/STA)",null,null,"Wx Full (ft)","PLANT MIX BIT. SURF. END AREA (ft2)","CRUSHED AGG. COURSE AREA (ft2)","Wx LT. (ft)","Wx RT. (ft)","PLANT MIX BIT. SURF. END AREA LT. (ft2)","PLANT MIX BIT. SURF. END AREA RT. (ft2)","CRUSHED AGG. COURSE AREA LT. (ft2)","CRUSHED AGG. COURSE AREA RT. (ft2)","WS LT. (ft)","WS RT. (ft)",null,"Z LT, ACTUAL (SEE APP. K, RDM)","Z RT, ACTUAL (SEE APP. K, RDM)"]
[{"$f":"'Project&Typical Info'!A16","v":1},{"$f":"IF(N16=TRUE,ROUND((200*B16/9),0),ROUND((B16+H16)*100/9,0))","v":356},{"$f":"ROUND(P41*100/27,1)","v":37.799999999999997},{"$f":"ROUND(Q41*100/27,1)","v":131.6},{"$f":"ROUND(C41*$F$5/2000,1)","v":72.900000000000006},{"$f":"ROUND(D41*$F$4/2000,1)","v":243.5},{"$f":"ROUND($F$2/100*E41,2)","v":3.94},{"$f":"ROUND(B41*$F$9*$F$6/2000,2)","v":0.64},{"$f":"ROUND(O41*100/9,0)","v":400},{"$f":"ROUND(ROUND(O41*100/9,0)*ROUNDUP(C16/0.2,0),0)","v":800},{"$f":"ROUND(J41*$F$7,0)","v":40},{"$f":"ROUND(B41*$F$8,0)","v":27},null,null,{"$f":"R41+S41","v":36},{"$f":"IF(C16=0,0,IF(N16=TRUE,ROUND((B16*2+O41)/2*C16,2),ROUND(T41+U41,2)))","v":10.199999999999999},{"$f":"IF(D16=0,0,IF(N16=TRUE,IF(K16=\"N\",ROUND((ROUND(B16+((C16+D16)*G16)/(1-F16*G16),1)*2+O41)/2*D16,2),O41*(0.5-C16)+(O41+4)*(D16-0.5+C16)),ROUND(V41+W41,2)))","v":35.53},{"$f":"IF(C16=0,0,IF(E16=\"N\",ROUND(B16+(C16*AA41/(1-F16*AA41)),1),ROUND(B16,1)))","v":18},{"$f":"IF(I16=0,0,IF(K16=\"N\",ROUND(H16+(I16*AB41/(1-L16*AB41)),1),ROUND(H16,1)))","v":18},{"$f":"(B16+R41)/2*C16","v":5.0999999999999996},{"$f":"(H16+S41)/2*I16","v":5.0999999999999996},{"$f":"IF(D16=0,0,IF(E16=\"N\",IF(F16>0.02,(R41-(R41-B16)+X41-(X41-B16))/2*D16+((X41-R41)*(D16-(F16-0.02)*(R41-B16))+(R41-B16)*(2*D16-(F16-0.02)*(R41-B16)))/2,(R41+X41)/2*D16),B16*(0.5-C16)+(B16+2)*(D16-0.5+C16)))","v":17.764999999999997},{"$f":"IF(J16=0,0,IF(K16=\"N\",IF(L16>0.02,(S41-(S41-H16)+Y41-(Y41-H16))/2*J16+((Y41-S41)*(J16-(L16-0.02)*(S41-H16))+(S41-H16)*(2*J16-(L16-0.02)*(S41-H16)))/2,(S41+Y41)/2*J16),H16*(0.5-I16)+(H16+2)*(J16-0.5+I16)))","v":17.764999999999997},{"$f":"IF(D16=0,0,IF(E16=\"N\",IF(F16<0.02,ROUND(B16+((C16+D16)*G16)/(1-F16*G16),1),ROUND(B16+((C16+D16)*G16)/(1-0.02*G16),1)),B16+2))","v":23.8},{"$f":"IF(J16=0,0,IF(K16=\"N\",IF(L16<0.02,ROUND(H16+((I16+J16)*M16)/(1-L16*M16),1),ROUND(H16+((I16+J16)*M16)/(1-0.02*M16),1)),H16+2))","v":23.8},null,{"$f":"IF(F16>0.02,(X41-B16)/(C16+D16+X41*0.02-B16*0.02),(X41-B16)/(C16+D16+X41*F16-B16*F16))","v":5.9724349157733547},{"$f":"IF(L16>0.02,(Y41-H16)/(I16+J16+Y41*0.02-H16*0.02),(Y41-H16)/(I16+J16+Y41*L16-H16*L16))","v":5.9724349157733547}]
[{"$f":"'Project&Typical Info'!A17","v":2},356,{"$f":"ROUND(P42*100/27,1)","v":37.700000000000003},{"$f":"ROUND(Q42*100/27,1)","v":127.3},72.7,235.5,{"$f":"ROUND($F$2/100*E42,2)","v":3.93},{"$f":"ROUND(B42*$F$9*$F$6/2000,2)","v":0.64},399,{"$f":"ROUND(ROUND(O42*100/9,0)*ROUNDUP(C17/0.2,0),0)","v":798},{"$f":"ROUND(J42*$F$7,0)","v":40},{"$f":"ROUND(B42*$F$8,0)","v":27},null,null,{"$f":"R42+S42","v":35.9},{"$f":"IF(C17=0,0,IF(N17=TRUE,ROUND((B17*2+O42)/2*C17,2),ROUND(T42+U42,2)))","v":10.19},{"$f":"IF(D17=0,0,IF(N17=TRUE,IF(K17=\"N\",ROUND((ROUND(B17+((C17+D17)*G17)/(1-F17*G17),1)*2+O42)/2*D17,2),O42*(0.5-C17)+(O42+4)*(D17-0.5+C17)),ROUND(V42+W42,2)))","v":34.369999999999997},{"$f":"IF(C17=0,0,IF(E17=\"N\",ROUND(B17+(C17*AA42/(1-F17*AA42)),1),ROUND(B17,1)))","v":17.5},18.399999999999999,{"$f":"(B17+R42)/2*C17","v":5.0249999999999995},{"$f":"(H17+S42)/2*I17","v":5.1599999999999993},{"$f":"IF(D17=0,0,IF(E17=\"N\",IF(F17>0.02,(R42-(R42-B17)+X42-(X42-B17))/2*D17+((X42-R42)*(D17-(F17-0.02)*(R42-B17))+(R42-B17)*(2*D17-(F17-0.02)*(R42-B17)))/2,(R42+X42)/2*D17),B17*(0.5-C17)+(B17+2)*(D17-0.5+C17)))","v":16.6175},{"$f":"IF(J17=0,0,IF(K17=\"N\",IF(L17>0.02,(S42-(S42-H17)+Y42-(Y42-H17))/2*J17+((Y42-S42)*(J17-(L17-0.02)*(S42-H17))+(S42-H17)*(2*J17-(L17-0.02)*(S42-H17)))/2,(S42+Y42)/2*J17),H17*(0.5-I17)+(H17+2)*(J17-0.5+I17)))","v":17.747799999999998},{"$f":"IF(D17=0,0,IF(E17=\"N\",IF(F17<0.02,ROUND(B17+((C17+D17)*G17)/(1-F17*G17),1),ROUND(B17+((C17+D17)*G17)/(1-0.02*G17),1)),B17+2))","v":21.6},{"$f":"IF(J17=0,0,IF(K17=\"N\",IF(L17<0.02,ROUND(H17+((I17+J17)*M17)/(1-L17*M17),1),ROUND(H17+((I17+J17)*M17)/(1-0.02*M17),1)),H17+2))","v":23.8},null,{"$f":"IF(F17>0.02,(X42-B17)/(C17+D17+X42*0.02-B17*0.02),(X42-B17)/(C17+D17+X42*F17-B17*F17))","v":6.0475161987041064},5.9724349157733547]
[{"$f":"'Project&Typical Info'!A18","v":3},0,0,0,0,0,0,0,0,0,0,0,null,null,0,0,0,0,0,0,0,0,0,0,0,null,{"$error":"#DIV/0!"},{"$error":"#DIV/0!"}]
[{"$f":"'Project&Typical Info'!A19","v":4},0,0,0,0,0,0,0,0,0,0,0,null,null,0,0,0,0,0,0,0,0,0,0,0,null,{"$error":"#DIV/0!"},{"$error":"#DIV/0!"}]
[{"$f":"'Project&Typical Info'!A20","v":5},0,0,0,0,0,0,0,0,0,0,0,null,null,0,0,0,0,0,0,0,0,0,0,0,null,{"$error":"#DIV/0!"},{"$error":"#DIV/0!"}]
[{"$f":"'Project&Typical Info'!A21","v":6},0,0,0,0,0,0,0,0,0,0,0,null,null,0,0,0,0,0,0,0,0,0,0,0,null,{"$error":"#DIV/0!"},{"$error":"#DIV/0!"}]
[{"$f":"'Project&Typical Info'!A22","v":7},0,0,0,0,0,0,0,0,0,0,0,null,null,0,0,0,0,0,0,0,0,0,0,0,null,{"$error":"#DIV/0!"},{"$error":"#DIV/0!"}]
[{"$f":"'Project&Typical Info'!A23","v":8},0,0,0,0,0,0,0,0,0,0,0,null,null,0,0,0,0,0,0,0,0,0,0,0,null,{"$error":"#DIV/0!"},{"$error":"#DIV/0!"}]
[{"$f":"'Project&Typical Info'!A24","v":9},0,0,0,0,0,0,0,0,0,0,0,null,null,0,0,0,0,0,0,0,0,0,0,0,null,{"$error":"#DIV/0!"},{"$error":"#DIV/0!"}]
[{"$f":"'Project&Typical Info'!A25","v":10},0,0,0,0,0,0,0,0,0,0,0,null,null,0,0,0,0,0,0,0,0,0,0,0,null,{"$error":"#DIV/0!"},{"$error":"#DIV/0!"}]
[{"$f":"'Project&Typical Info'!A26","v":11},0,0,0,0,0,0,0,0,0,0,0,null,null,0,0,0,0,0,0,0,0,0,0,0,null,{"$error":"#DIV/0!"},{"$error":"#DIV/0!"}]
[{"$f":"'Project&Typical Info'!A27","v":12},0,0,0,0,0,0,0,0,0,0,0,null,null,0,0,0,0,0,0,0,0,0,0,0,null,{"$error":"#DIV/0!"},{"$error":"#DIV/0!"}]
[{"$f":"'Project&Typical Info'!A28","v":13},0,0,0,0,0,0,0,0,0,0,0,null,null,0,0,0,0,0,0,0,0,0,0,0,null,{"$error":"#DIV/0!"},{"$error":"#DIV/0!"}]
[{"$f":"'Project&Typical Info'!A29","v":14},0,0,0,0,0,0,0,0,0,0,0,null,null,0,0,0,0,0,0,0,0,0,0,0,null,{"$error":"#DIV/0!"},{"$error":"#DIV/0!"}]
[{"$f":"'Project&Typical Info'!A30","v":15},0,0,0,0,0,0,0,0,0,0,0,null,null,0,0,0,0,0,0,0,0,0,0,0,null,{"$error":"#DIV/0!"},{"$error":"#DIV/0!"}]
[{"$f":"'Project&Typical Info'!A31","v":16},0,0,0,0,0,0,0,0,0,0,0,null,null,0,0,0,0,0,0,0,0,0,0,0,null,{"$error":"#DIV/0!"},{"$error":"#DIV/0!"}]
[{"$f":"'Project&Typical Info'!A32","v":17},0,0,0,0,0,0,0,0,0,0,0,null,null,0,0,0,0,0,0,0,0,0,0,0,null,{"$error":"#DIV/0!"},{"$error":"#DIV/0!"}]
[{"$f":"'Project&Typical Info'!A33","v":18},0,0,0,0,0,0,0,0,0,0,0,null,null,0,0,0,0,0,0,0,0,0,0,0,null,{"$error":"#DIV/0!"},{"$error":"#DIV/0!"}]
[{"$f":"'Project&Typical Info'!A34","v":19},0,0,0,0,0,0,0,0,0,0,0,null,null,0,0,0,0,0,0,0,0,0,0,0,null,{"$error":"#DIV/0!"},{"$error":"#DIV/0!"}]
[{"$f":"'Project&Typical Info'!A35","v":20},0,0,0,0,0,0,0,0,0,0,0,null,null,0,0,0,0,0,0,0,0,0,0,0,null,{"$error":"#DIV/0!"},{"$error":"#DIV/0!"}]

{"sheet":"Surfacing Frame Quantities","index":2,"n_rows":101,"n_cols":174,"rows_kept":101,"cut":false,"hidden":true,"merged":[[100,34,100,169],[3,14,4,14],[3,11,4,11],[2,14,2,15],[2,16,4,16],[1,19,4,19],[1,34,1,169],[3,32,4,32],[3,31,4,31],[3,30,4,30],[3,29,4,29],[3,28,4,28],[1,17,1,18],[2,18,4,18],[2,17,4,17],[3,27,4,27],[0,170,1,170],[0,0,0,19],[3,12,4,12],[1,6,4,6],[1,0,3,1],[1,2,1,5],[2,2,4,2],[3,15,4,15],[2,3,4,3],[3,9,4,9],[2,7,4,7],[2,5,4,5],[2,4,4,4],[3,8,4,8],[3,10,4,10],[3,13,4,13],[1,8,1,13],[1,14,1,15],[1,22,1,32],[3,25,4,25],[3,22,4,22],[3,23,4,23],[3,24,4,24],[3,26,4,26]]}
["SURFACING"]
["STATION",null,"linear feet",null,null,null,"FOR","tons","AGGREGATE",null,null,null,null,null,"BITUMINOUS MATERIAL",null,"sq. yards","gals",null,"REMARKS",null,null,"VALUES USED PER STATION",null,null,null,null,null,null,null,null,null,null,null,"Length of Typical Sections (ft)                                                                          Length of Typical Sections (ft)                                                                          Length of Typical Sections (ft)                                                                          Length of Typical Sections (ft)                                                                          Length of Typical Sections (ft)                                                                          Length of Typical Sections (ft)                                                                          Length of Typical Sections (ft)                                                                          Length of Typical Sections (ft)                                                                          Length of Typical Sections (ft)"]
[null,null,"GROSS","NET","+","-",null,"HYDRATED LIME","sq. yards","tons","cubic yards","SPECIAL BORROW","TRAFFIC GRAVEL","SHOULDER GRAVEL","tons",null,"AGG. TREAT.","EMULSIFIED ASPHALT TACK","EMULSIFIED ASPHALT FOG SEAL"]
[null,null,null,null,null,null,null,null,"COVER","PLANT MIX BIT. SURF.","CRUSHED AGG. COURSE","SPECIAL BORROW","TRAFFIC GRAVEL","SHOULDER GRAVEL","ASPHALT CEMENT","SEAL",null,null,null,null,null,null,{"$f":"'Lookup Values'!C1","v":"COVER\nyd2/STA"},{"$f":"'Lookup Values'!D1","v":"PLANT MIX\nT/STA"},{"$f":"'Lookup Values'!E1","v":"CRUSHED AGG. COURSE\nyd3/STA"},{"$f":"'Lookup Values'!F1","v":"SPECIAL BORROW"},{"$f":"'Lookup Values'!G1","v":"TRAFFIC GRAVEL"},{"$f":"'Lookup Values'!H1","v":"SHOULDER GRAVEL"},{"$f":"'Lookup Values'!I1","v":"ASPHALT CEMENT\nT/STA"},{"$f":"'Lookup Values'!J1","v":"SEAL\nT/STA"},{"$f":"'Lookup Values'!K1","v":"AGG. TREAT.\nyd2/STA"},{"$f":"'Lookup Values'!L1","v":"EMULS. ASPHALT TACK\ngal/STA"},{"$f":"'Lookup Values'!M1","v":"EMULS. ASPHALT FOG SEAL\ngal/STA"},null,"TYP. 1","TYP. 2","TRANS. TYP. 1 - TYP. 2","TYP. 3","TRANS. TYP. 1 - TYP. 3","TRANS. TYP. 2 - TYP. 3","TYP. 4","TRANS. TYP. 1 - TYP. 4","TRANS. TYP. 2 - TYP. 4","TRANS. TYP. 3 - TYP. 4","TYP. 5","TRANS. TYP. 1 - TYP. 5","TRANS. TYP. 2 - TYP. 5","TRANS. TYP. 3 - TYP. 5","TRANS. TYP. 4 - TYP. 5","TYP. 6","TRANS. TYP. 1 - TYP. 6","TRANS. TYP. 2 - TYP. 6","TRANS. TYP. 3 - TYP. 6","TRANS. TYP. 4 - TYP. 6","TRANS. TYP. 5 - TYP. 6","TYP. 7","TRANS. TYP. 7 - TYP. 1","TRANS. TYP. 7 - TYP. 2","TRANS. TYP. 7 - TYP. 3","TRANS. TYP. 7 - TYP. 4","TRANS. TYP. 7 - TYP. 5","TRANS. TYP. 7 - TYP. 6","TYP. 8","TRANS. TYP. 8 - TYP. 1","TRANS. TYP. 8 - TYP. 2","TRANS. TYP. 8 - TYP. 3","TRANS. TYP. 8 - TYP. 4","TRANS. TYP. 8 - TYP. 5","TRANS. TYP. 8 - TYP. 6","TRANS. TYP. 8 - TYP. 7","TYP. 9","TRANS. TYP. 9 - TYP. 1","TRANS. TYP. 9 - TYP. 2","TRANS. TYP. 9 - TYP. 3","TRANS. TYP. 9 - TYP. 4","TRANS. TYP. 9 - TYP. 5","TRANS. TYP. 9 - TYP. 6","TRANS. TYP. 9 - TYP. 7","TRANS. TYP. 9 - TYP. 8","TYP. 10","TRANS. TYP. 10 - TYP. 1","TRANS. TYP. 10 - TYP. 2","TRANS. TYP. 10 - TYP. 3","TRANS. TYP. 10 - TYP. 4","TRANS. TYP. 10 - TYP. 5","TRANS. TYP. 10 - TYP. 6","TRANS. TYP. 10 - TYP. 7","TRANS. TYP. 10 - TYP. 8","TRANS. TYP. 10 - TYP. 9","TYP. 11","TRANS. TYP. 11 - TYP. 1","TRANS. TYP. 11 - TYP. 2","TRANS. TYP. 11 - TYP. 3","TRANS. TYP. 11 - TYP. 4","TRANS. TYP. 11 - TYP. 5","TRANS. TYP. 11 - TYP. 6","TRANS. TYP. 11 - TYP. 7","TRANS. TYP. 11 - TYP. 8","TRANS. TYP. 11 - TYP. 9","TRANS. TYP. 11 - TYP. 10","TYP. 12","TRANS. TYP. 12 - TYP. 1","TRANS. TYP. 12 - TYP. 2","TRANS. TYP. 12 - TYP. 3","TRANS. TYP. 12 - TYP. 4","TRANS. TYP. 12 - TYP. 5","TRANS. TYP. 12 - TYP. 6","TRANS. TYP. 12 - TYP. 7","TRANS. TYP. 12 - TYP. 8","TRANS. TYP. 12 - TYP. 9","TRANS. TYP. 12 - TYP. 10","TRANS. TYP. 12 - TYP. 11","TYP. 13","TRANS. TYP. 13 - TYP. 1","TRANS. TYP. 13 - TYP. 2","TRANS. TYP. 13 - TYP. 3","TRANS. TYP. 13 - TYP. 4","TRANS. TYP. 13 - TYP. 5","TRANS. TYP. 13 - TYP. 6","TRANS. TYP. 13 - TYP. 7","TRANS. TYP. 13 - TYP. 8","TRANS. TYP. 13 - TYP. 9","TRANS. TYP. 13 - TYP. 10","TRANS. TYP. 13 - TYP. 11","TRANS. TYP. 13 - TYP. 12","TYP. 14","TRANS. TYP. 14 - TYP. 1","TRANS. TYP. 14 - TYP. 2","TRANS. TYP. 14 - TYP. 3","TRANS. TYP. 14 - TYP. 4","TRANS. TYP. 14 - TYP. 5","TRANS. TYP. 14 - TYP. 6","TRANS. TYP. 14 - TYP. 7","TRANS. TYP. 14 - TYP. 8","TRANS. TYP. 14 - TYP. 9","TRANS. TYP. 14 - TYP. 10","TRANS. TYP. 14 - TYP. 11","TRANS. TYP. 14 - TYP. 12","TRANS. TYP. 14 - TYP. 13","TYP. 15","TRANS. TYP. 15 - TYP. 1","TRANS. TYP. 15 - TYP. 2","TRANS. TYP. 15 - TYP. 3","TRANS. TYP. 15 - TYP. 4","TRANS. TYP. 15 - TYP. 5","TRANS. TYP. 15 - TYP. 6","TRANS. TYP. 15 - TYP. 7","TRANS. TYP. 15 - TYP. 8","TRANS. TYP. 15 - TYP. 9","TRANS. TYP. 15 - TYP. 10","TRANS. TYP. 15 - TYP. 11","TRANS. TYP. 15 - TYP. 12","TRANS. TYP. 15 - TYP. 13","TRANS. TYP. 15 - TYP. 14","TYP. 16","TRANS. TYP. 16 - TYP. 1","TRANS. TYP. 16 - TYP. 2","TRANS. TYP. 16 - TYP. 3","TRANS. TYP. 16 - TYP. 4","TRANS. TYP. 16 - TYP. 5","TRANS. TYP. 16 - TYP. 6","TRANS. TYP. 16 - TYP. 7","TRANS. TYP. 16 - TYP. 8","TRANS. TYP. 16 - TYP. 9","TRANS. TYP. 16 - TYP. 10","TRANS. TYP. 16 - TYP. 11","TRANS. TYP. 16 - TYP. 12","TRANS. TYP. 16 - TYP. 13","TRANS. TYP. 16 - TYP. 14","TRANS. TYP. 16 - TYP. 15"]
["FROM","TO"]
[1074.0999999999999,1120.07,{"$f":"IF(AND(A6=0,B6=0),\"\",IF(OR(G6=\"BRIDGE\",G7=\"BRIDGE\"),\"\",IF(G5=\"BRIDGE\",B6-A4,B6-A6)))","v":45.970000000000027},{"$f":"IF(C6=\"\",\"\",IF(G5=\"BRIDGE\",C6+E5-F5,IF(C6+E6-F6=0,\"\",C6+E6-F6)))","v":45.970000000000027},null,null,null,null,{"$f":"IF(OR($G6=\"BRIDGE\",$G7=\"BRIDGE\"),\"\",IF(AND($D6=\"\",$A6>0,$B6>0),\"~\",IF(W6=\"ERROR\",\"\",IF(W6=0,\"\",ROUND(W6*$D6/100,0)))))","v":164},{"$f":"IF(OR($G6=\"BRIDGE\",$G7=\"BRIDGE\"),\"\",IF(AND($D6=\"\",$A6>0,$B6>0),\"~\",IF(X6=\"ERROR\",\"\",IF(X6=0,\"\",ROUND(X6*$D6/100,0)))))","v":34},60,"","","",{"$f":"IF(OR($G6=\"BRIDGE\",$G7=\"BRIDGE\"),\"\",IF(AND($D6=\"\",$A6>0,$B6>0),\"~\",IF(AC6=\"ERROR\",\"\",IF(AC6=0,\"\",ROUND(AC6*$D6/100,1)))))","v":1.8},{"$f":"IF(OR($G6=\"BRIDGE\",$G7=\"BRIDGE\"),\"\",IF(AND($D6=\"\",$A6>0,$B6>0),\"~\",IF(AD6=\"ERROR\",\"\",IF(AD6=0,\"\",ROUND(AD6*$D6/100,1)))))","v":0.3},184,18,12,"TYP. NO. 1",null,{"$f":"IF(T6=\"\",402,MATCH(T6,'Lookup Values'!$B$1:$B$402,0))","v":2},{"$f":"LOOKUP($V6,'Lookup Values'!$A$2:$A$402,'Lookup Values'!C$2:C$402)","v":356},{"$f":"LOOKUP($V6,'Lookup Values'!$A$2:$A$402,'Lookup Values'!D$2:D$402)","v":72.900000000000006},{"$f":"LOOKUP($V6,'Lookup Values'!$A$2:$A$402,'Lookup Values'!E$2:E$402)","v":131.6},{"$f":"LOOKUP($V6,'Lookup Values'!$A$2:$A$402,'Lookup Values'!F$2:F$402)","v":0},{"$f":"LOOKUP($V6,'Lookup Values'!$A$2:$A$402,'Lookup Values'!G$2:G$402)","v":0},{"$f":"LOOKUP($V6,'Lookup Values'!$A$2:$A$402,'Lookup Values'!H$2:H$402)","v":0},{"$f":"LOOKUP($V6,'Lookup Values'!$A$2:$A$402,'Lookup Values'!I$2:I$402)","v":3.94},{"$f":"LOOKUP($V6,'Lookup Values'!$A$2:$A$402,'Lookup Values'!J$2:J$402)","v":0.64},{"$f":"LOOKUP($V6,'Lookup Values'!$A$2:$A$402,'Lookup Values'!K$2:K$402)","v":400},{"$f":"LOOKUP($V6,'Lookup Values'!$A$2:$A$402,'Lookup Values'!L$2:L$402)","v":40},{"$f":"LOOKUP($V6,'Lookup Values'!$A$2:$A$402,'Lookup Values'!M$2:M$402)","v":27},null,{"$f":"IF(T6=\"TYP. NO. 1\",D6,0)","v":45.970000000000027},{"$f":"IF(T6=\"TYP. NO. 2\",D6,0)","v":0},{"$f":"IF(T6=\"TRANS. TYP. NO. 1 TO TYP. NO. 2\",D6,IF(T6=\"TRANS. TYP. NO. 2 TO TYP. NO. 1\",D6,0))","v":0},{"$f":"IF(T6=\"TYP. NO. 3\",D6,0)","v":0},{"$f":"IF(T6=\"TRANS. TYP. NO. 1 TO TYP. NO. 3\",D6,IF(T6=\"TRANS. TYP. NO. 3 TO TYP. NO. 1\",D6,0))","v":0},{"$f":"IF(T6=\"TRANS. TYP. NO. 2 TO TYP. NO. 3\",D6,IF(T6=\"TRANS. TYP. NO. 3 TO TYP. NO. 2\",D6,0))","v":0},{"$f":"IF(T6=\"TYP. NO. 4\",D6,0)","v":0},{"$f":"IF(T6=\"TRANS. TYP. NO. 1 TO TYP. NO. 4\",D6,IF(T6=\"TRANS. TYP. NO. 4 TO TYP. NO. 1\",D6,0))","v":0},{"$f":"IF(T6=\"TRANS. TYP. NO. 2 TO TYP. NO. 4\",D6,IF(T6=\"TRANS. TYP. NO. 4 TO TYP. NO. 2\",D6,0))","v":0},{"$f":"IF(T6=\"TRANS. TYP. NO. 3 TO TYP. NO. 4\",D6,IF(T6=\"TRANS. TYP. NO. 4 TO TYP. NO. 3\",D6,0))","v":0},{"$f":"IF(T6=\"TYP. NO. 5\",D6,0)","v":0},{"$f":"IF(T6=\"TRANS. TYP. NO. 1 TO TYP. NO. 5\",D6,IF(T6=\"TRANS. TYP. NO. 5 TO TYP. NO. 1\",D6,0))","v":0},{"$f":"IF(T6=\"TRANS. TYP. NO. 2 TO TYP. NO. 5\",D6,IF(T6=\"TRANS. TYP. NO. 5 TO TYP. NO. 2\",D6,0))","v":0},{"$f":"IF(T6=\"TRANS. TYP. NO. 3 TO TYP. NO. 5\",D6,IF(T6=\"TRANS. TYP. NO. 5 TO TYP. NO. 3\",D6,0))","v":0},{"$f":"IF(T6=\"TRANS. TYP. NO. 4 TO TYP. NO. 5\",D6,IF(T6=\"TRANS. TYP. NO. 5 TO TYP. NO. 4\",D6,0))","v":0},{"$f":"IF(T6=\"TYP. NO. 6\",D6,0)","v":0},{"$f":"IF(T6=\"TRANS. TYP. NO. 1 TO TYP. NO. 6\",D6,IF(T6=\"TRANS. TYP. NO. 6 TO TYP. NO. 1\",D6,0))","v":0},{"$f":"IF(T6=\"TRANS. TYP. NO. 2 TO TYP. NO. 6\",D6,IF(T6=\"TRANS. TYP. NO. 6 TO TYP. NO. 2\",D6,0))","v":0},{"$f":"IF(T6=\"TRANS. TYP. NO. 3 TO TYP. NO. 6\",D6,IF(T6=\"TRANS. TYP. NO. 6 TO TYP. NO. 3\",D6,0))","v":0},{"$f":"IF(T6=\"TRANS. TYP. NO. 4 TO TYP. NO. 6\",D6,IF(T6=\"TRANS. TYP. NO. 6 TO TYP. NO. 4\",D6,0))","v":0},{"$f":"IF(T6=\"TRANS. TYP. NO. 5 TO TYP. NO. 6\",D6,IF(T6=\"TRANS. TYP. NO. 6 TO TYP. NO. 5\",D6,0))","v":0},{"$f":"IF(T6=\"TYP. NO. 7\",D6,0)","v":0},{"$f":"IF(T6=\"TRANS. TYP. NO. 1 TO TYP. NO. 7\",D6,IF(T6=\"TRANS. TYP. NO. 7 TO TYP. NO. 1\",D6,0))","v":0},{"$f":"IF(T6=\"TRANS. TYP. NO. 2 TO TYP. NO. 7\",D6,IF(T6=\"TRANS. TYP. NO. 7 TO TYP. NO. 2\",D6,0))","v":0},{"$f":"IF(T6=\"TRANS. TYP. NO. 3 TO TYP. NO. 7\",D6,IF(T6=\"TRANS. TYP. NO. 7 TO TYP. NO. 3\",D6,0))","v":0},{"$f":"IF(T6=\"TRANS. TYP. NO. 4 TO TYP. NO. 7\",D6,IF(T6=\"TRANS. TYP. NO. 7 TO TYP. NO. 4\",D6,0))","v":0},{"$f":"IF(T6=\"TRANS. TYP. NO. 5 TO TYP. NO. 7\",D6,IF(T6=\"TRANS. TYP. NO. 7 TO TYP. NO. 5\",D6,0))","v":0},{"$f":"IF(T6=\"TRANS. TYP. NO. 6 TO TYP. NO. 7\",D6,IF(T6=\"TRANS. TYP. NO. 7 TO TYP. NO. 6\",D6,0))","v":0},{"$f":"IF(T6=\"TYP. NO. 8\",D6,0)","v":0},{"$f":"IF($T6=\"TRANS. TYP. NO. 1 TO TYP. NO. 8\",$D6,IF($T6=\"TRANS. TYP. NO. 8 TO TYP. NO. 1\",$D6,0))","v":0},{"$f":"IF($T6=\"TRANS. TYP. NO. 2 TO TYP. NO. 8\",$D6,IF($T6=\"TRANS. TYP. NO. 8 TO TYP. NO. 2\",$D6,0))","v":0},{"$f":"IF($T6=\"TRANS. TYP. NO. 3 TO TYP. NO. 8\",$D6,IF($T6=\"TRANS. TYP. NO. 8 TO TYP. NO. 3\",$D6,0))","v":0},{"$f":"IF($T6=\"TRANS. TYP. NO. 4 TO TYP. NO. 8\",$D6,IF($T6=\"TRANS. TYP. NO. 8 TO TYP. NO. 4\",$D6,0))","v":0},{"$f":"IF($T6=\"TRANS. TYP. NO. 5 TO TYP. NO. 8\",$D6,IF($T6=\"TRANS. TYP. NO. 8 TO TYP. NO. 5\",$D6,0))","v":0},{"$f":"IF($T6=\"TRANS. TYP. NO. 6 TO TYP. NO. 8\",$D6,IF($T6=\"TRANS. TYP. NO. 8 TO TYP. NO. 6\",$D6,0))","v":0},{"$f":"IF($T6=\"TRANS. TYP. NO. 7 TO TYP. NO. 8\",$D6,IF($T6=\"TRANS. TYP. NO. 8 TO TYP. NO. 7\",$D6,0))","v":0},{"$f":"IF(T6=\"TYP. NO. 9\",D6,0)","v":0},{"$f":"IF($T6=\"TRANS. TYP. NO. 1 TO TYP. NO. 9\",$D6,IF($T6=\"TRANS. TYP. NO. 9 TO TYP. NO. 1\",$D6,0))","v":0},{"$f":"IF($T6=\"TRANS. TYP. NO. 2 TO TYP. NO. 9\",$D6,IF($T6=\"TRANS. TYP. NO. 9 TO TYP. NO. 2\",$D6,0))","v":0},{"$f":"IF($T6=\"TRANS. TYP. NO. 3 TO TYP. NO. 9\",$D6,IF($T6=\"TRANS. TYP. NO. 9 TO TYP. NO. 3\",$D6,0))","v":0},{"$f":"IF($T6=\"TRANS. TYP. NO. 4 TO TYP. NO. 9\",$D6,IF($T6=\"TRANS. TYP. NO. 9 TO TYP. NO. 4\",$D6,0))","v":0},{"$f":"IF($T6=\"TRANS. TYP. NO. 5 TO TYP. NO. 9\",$D6,IF($T6=\"TRANS. TYP. NO. 9 TO TYP. NO. 5\",$D6,0))","v":0},{"$f":"IF($T6=\"TRANS. TYP. NO. 6 TO TYP. NO. 9\",$D6,IF($T6=\"TRANS. TYP. NO. 9 TO TYP. NO. 6\",$D6,0))","v":0},{"$f":"IF($T6=\"TRANS. TYP. NO. 7 TO TYP. NO. 9\",$D6,IF($T6=\"TRANS. TYP. NO. 9 TO TYP. NO. 7\",$D6,0))","v":0},{"$f":"IF($T6=\"TRANS. TYP. NO. 8 TO TYP. NO. 9\",$D6,IF($T6=\"TRANS. TYP. NO. 9 TO TYP. NO. 8\",$D6,0))","v":0},{"$f":"IF(T6=\"TYP. NO. 10\",D6,0)","v":0},{"$f":"IF($T6=\"TRANS. TYP. NO. 1 TO TYP. NO. 10\",$D6,IF($T6=\"TRANS. TYP. NO. 10 TO TYP. NO. 1\",$D6,0))","v":0},{"$f":"IF($T6=\"TRANS. TYP. NO. 2 TO TYP. NO. 10\",$D6,IF($T6=\"TRANS. TYP. NO. 10 TO TYP. NO. 2\",$D6,0))","v":0},{"$f":"IF($T6=\"TRANS. TYP. NO. 3 TO TYP. NO. 10\",$D6,IF($T6=\"TRANS. TYP. NO. 10 TO TYP. NO. 3\",$D6,0))","v":0},{"$f":"IF($T6=\"TRANS. TYP. NO. 4 TO TYP. NO. 10\",$D6,IF($T6=\"TRANS. TYP. NO. 10 TO TYP. NO. 4\",$D6,0))","v":0},{"$f":"IF($T6=\"TRANS. TYP. NO. 5 TO TYP. NO. 10\",$D6,IF($T6=\"TRANS. TYP. NO. 10 TO TYP. NO. 5\",$D6,0))","v":0},{"$f":"IF($T6=\"TRANS. TYP. NO. 6 TO TYP. NO. 10\",$D6,IF($T6=\"TRANS. TYP. NO. 10 TO TYP. NO. 6\",$D6,0))","v":0},{"$f":"IF($T6=\"TRANS. TYP. NO. 7 TO TYP. NO. 10\",$D6,IF($T6=\"TRANS. TYP. NO. 10 TO TYP. NO. 7\",$D6,0))","v":0},{"$f":"IF($T6=\"TRANS. TYP. NO. 8 TO TYP. NO. 10\",$D6,IF($T6=\"TRANS. TYP. NO. 10 TO TYP. NO. 8\",$D6,0))","v":0},{"$f":"IF($T6=\"TRANS. TYP. NO. 9 TO TYP. NO. 10\",$D6,IF($T6=\"TRANS. TYP. NO. 10 TO TYP. NO. 9\",$D6,0))","v":0},{"$f":"IF(T6=\"TYP. NO. 11\",D6,0)","v":0},{"$f":"IF($T6=\"TRANS. TYP. NO. 1 TO TYP. NO. 11\",$D6,IF($T6=\"TRANS. TYP. NO. 11 TO TYP. NO. 1\",$D6,0))","v":0},{"$f":"IF($T6=\"TRANS. TYP. NO. 2 TO TYP. NO. 11\",$D6,IF($T6=\"TRANS. TYP. NO. 11 TO TYP. NO. 2\",$D6,0))","v":0},{"$f":"IF($T6=\"TRANS. TYP. NO. 3 TO TYP. NO. 11\",$D6,IF($T6=\"TRANS. TYP. NO. 11 TO TYP. NO. 3\",$D6,0))","v":0},{"$f":"IF($T6=\"TRANS. TYP. NO. 4 TO TYP. NO. 11\",$D6,IF($T6=\"TRANS. TYP. NO. 11 TO TYP. NO. 4\",$D6,0))","v":0},{"$f":"IF($T6=\"TRANS. TYP. NO. 5 TO TYP. NO. 11\",$D6,IF($T6=\"TRANS. TYP. NO. 11 TO TYP. NO. 5\",$D6,0))","v":0},{"$f":"IF($T6=\"TRANS. TYP. NO. 6 TO TYP. NO. 11\",$D6,IF($T6=\"TRANS. TYP. NO. 11 TO TYP. NO. 6\",$D6,0))","v":0},{"$f":"IF($T6=\"TRANS. TYP. NO. 7 TO TYP. NO. 11\",$D6,IF($T6=\"TRANS. TYP. NO. 11 TO TYP. NO. 7\",$D6,0))","v":0},{"$f":"IF($T6=\"TRANS. TYP. NO. 8 TO TYP. NO. 11\",$D6,IF($T6=\"TRANS. TYP. NO. 11 TO TYP. NO. 8\",$D6,0))","v":0},{"$f":"IF($T6=\"TRANS. TYP. NO. 9 TO TYP. NO. 11\",$D6,IF($T6=\"TRANS. TYP. NO. 11 TO TYP. NO. 9\",$D6,0))","v":0},{"$f":"IF($T6=\"TRANS. TYP. NO. 10 TO TYP. NO. 11\",$D6,IF($T6=\"TRANS. TYP. NO. 11 TO TYP. NO. 10\",$D6,0))","v":0},{"$f":"IF(T6=\"TYP. NO. 12\",D6,0)","v":0},{"$f":"IF($T6=\"TRANS. TYP. NO. 1 TO TYP. NO. 12\",$D6,IF($T6=\"TRANS. TYP. NO. 12 TO TYP. NO. 1\",$D6,0))","v":0},{"$f":"IF($T6=\"TRANS. TYP. NO. 2 TO TYP. NO. 12\",$D6,IF($T6=\"TRANS. TYP. NO. 12 TO TYP. NO. 2\",$D6,0))","v":0},{"$f":"IF($T6=\"TRANS. TYP. NO. 3 TO TYP. NO. 12\",$D6,IF($T6=\"TRANS. TYP. NO. 12 TO TYP. NO. 3\",$D6,0))","v":0},{"$f":"IF($T6=\"TRANS. TYP. NO. 4 TO TYP. NO. 12\",$D6,IF($T6=\"TRANS. TYP. NO. 12 TO TYP. NO. 4\",$D6,0))","v":0},{"$f":"IF($T6=\"TRANS. TYP. NO. 5 TO TYP. NO. 12\",$D6,IF($T6=\"TRANS. TYP. NO. 12 TO TYP. NO. 5\",$D6,0))","v":0},{"$f":"IF($T6=\"TRANS. TYP. NO. 6 TO TYP. NO. 12\",$D6,IF($T6=\"TRANS. TYP. NO. 12 TO TYP. NO. 6\",$D6,0))","v":0},{"$f":"IF($T6=\"TRANS. TYP. NO. 7 TO TYP. NO. 12\",$D6,IF($T6=\"TRANS. TYP. NO. 12 TO TYP. NO. 7\",$D6,0))","v":0},{"$f":"IF($T6=\"TRANS. TYP. NO. 8 TO TYP. NO. 12\",$D6,IF($T6=\"TRANS. TYP. NO. 12 TO TYP. NO. 8\",$D6,0))","v":0},{"$f":"IF($T6=\"TRANS. TYP. NO. 9 TO TYP. NO. 12\",$D6,IF($T6=\"TRANS. TYP. NO. 12 TO TYP. NO. 9\",$D6,0))","v":0},{"$f":"IF($T6=\"TRANS. TYP. NO. 10 TO TYP. NO. 12\",$D6,IF($T6=\"TRANS. TYP. NO. 12 TO TYP. NO. 10\",$D6,0))","v":0},{"$f":"IF($T6=\"TRANS. TYP. NO. 11 TO TYP. NO. 12\",$D6,IF($T6=\"TRANS. TYP. NO. 12 TO TYP. NO. 11\",$D6,0))","v":0},{"$f":"IF(T6=\"TYP. NO. 13\",D6,0)","v":0},{"$f":"IF($T6=\"TRANS. TYP. NO. 1 TO TYP. NO. 13\",$D6,IF($T6=\"TRANS. TYP. NO. 13 TO TYP. NO. 1\",$D6,0))","v":0},{"$f":"IF($T6=\"TRANS. TYP. NO. 2 TO TYP. NO. 13\",$D6,IF($T6=\"TRANS. TYP. NO. 13 TO TYP. NO. 2\",$D6,0))","v":0},{"$f":"IF($T6=\"TRANS. TYP. NO. 3 TO TYP. NO. 13\",$D6,IF($T6=\"TRANS. TYP. NO. 13 TO TYP. NO. 3\",$D6,0))","v":0},{"$f":"IF($T6=\"TRANS. TYP. NO. 4 TO TYP. NO. 13\",$D6,IF($T6=\"TRANS. TYP. NO. 13 TO TYP. NO. 4\",$D6,0))","v":0},{"$f":"IF($T6=\"TRANS. TYP. NO. 5 TO TYP. NO. 13\",$D6,IF($T6=\"TRANS. TYP. NO. 13 TO TYP. NO. 5\",$D6,0))","v":0},{"$f":"IF($T6=\"TRANS. TYP. NO. 6 TO TYP. NO. 13\",$D6,IF($T6=\"TRANS. TYP. NO. 13 TO TYP. NO. 6\",$D6,0))","v":0},{"$f":"IF($T6=\"TRANS. TYP. NO. 7 TO TYP. NO. 13\",$D6,IF($T6=\"TRANS. TYP. NO. 13 TO TYP. NO. 7\",$D6,0))","v":0},{"$f":"IF($T6=\"TRANS. TYP. NO. 8 TO TYP. NO. 13\",$D6,IF($T6=\"TRANS. TYP. NO. 13 TO TYP. NO. 8\",$D6,0))","v":0},{"$f":"IF($T6=\"TRANS. TYP. NO. 9 TO TYP. NO. 13\",$D6,IF($T6=\"TRANS. TYP. NO. 13 TO TYP. NO. 9\",$D6,0))","v":0},{"$f":"IF($T6=\"TRANS. TYP. NO. 10 TO TYP. NO. 13\",$D6,IF($T6=\"TRANS. TYP. NO. 13 TO TYP. NO. 10\",$D6,0))","v":0},{"$f":"IF($T6=\"TRANS. TYP. NO. 11 TO TYP. NO. 13\",$D6,IF($T6=\"TRANS. TYP. NO. 13 TO TYP. NO. 11\",$D6,0))","v":0},{"$f":"IF($T6=\"TRANS. TYP. NO. 12 TO TYP. NO. 13\",$D6,IF($T6=\"TRANS. TYP. NO. 13 TO TYP. NO. 12\",$D6,0))","v":0},{"$f":"IF(T6=\"TYP. NO. 14\",D6,0)","v":0},{"$f":"IF($T6=\"TRANS. TYP. NO. 1 TO TYP. NO. 14\",$D6,IF($T6=\"TRANS. TYP. NO. 14 TO TYP. NO. 1\",$D6,0))","v":0},{"$f":"IF($T6=\"TRANS. TYP. NO. 2 TO TYP. NO. 14\",$D6,IF($T6=\"TRANS. TYP. NO. 14 TO TYP. NO. 2\",$D6,0))","v":0},{"$f":"IF($T6=\"TRANS. TYP. NO. 3 TO TYP. NO. 14\",$D6,IF($T6=\"TRANS. TYP. NO. 14 TO TYP. NO. 3\",$D6,0))","v":0},{"$f":"IF($T6=\"TRANS. TYP. NO. 4 TO TYP. NO. 14\",$D6,IF($T6=\"TRANS. TYP. NO. 14 TO TYP. NO. 4\",$D6,0))","v":0},{"$f":"IF($T6=\"TRANS. TYP. NO. 5 TO TYP. NO. 14\",$D6,IF($T6=\"TRANS. TYP. NO. 14 TO TYP. NO. 5\",$D6,0))","v":0},{"$f":"IF($T6=\"TRANS. TYP. NO. 6 TO TYP. NO. 14\",$D6,IF($T6=\"TRANS. TYP. NO. 14 TO TYP. NO. 6\",$D6,0))","v":0},{"$f":"IF($T6=\"TRANS. TYP. NO. 7 TO TYP. NO. 14\",$D6,IF($T6=\"TRANS. TYP. NO. 14 TO TYP. NO. 7\",$D6,0))","v":0},{"$f":"IF($T6=\"TRANS. TYP. NO. 8 TO TYP. NO. 14\",$D6,IF($T6=\"TRANS. TYP. NO. 14 TO TYP. NO. 8\",$D6,0))","v":0},{"$f":"IF($T6=\"TRANS. TYP. NO. 9 TO TYP. NO. 14\",$D6,IF($T6=\"TRANS. TYP. NO. 14 TO TYP. NO. 9\",$D6,0))","v":0},{"$f":"IF($T6=\"TRANS. TYP. NO. 10 TO TYP. NO. 14\",$D6,IF($T6=\"TRANS. TYP. NO. 14 TO TYP. NO. 10\",$D6,0))","v":0},{"$f":"IF($T6=\"TRANS. TYP. NO. 11 TO TYP. NO. 14\",$D6,IF($T6=\"TRANS. TYP. NO. 14 TO TYP. NO. 11\",$D6,0))","v":0},{"$f":"IF($T6=\"TRANS. TYP. NO. 12 TO TYP. NO. 14\",$D6,IF($T6=\"TRANS. TYP. NO. 14 TO TYP. NO. 12\",$D6,0))","v":0},{"$f":"IF($T6=\"TRANS. TYP. NO. 13 TO TYP. NO. 14\",$D6,IF($T6=\"TRANS. TYP. NO. 14 TO TYP. NO. 13\",$D6,0))","v":0},{"$f":"IF(T6=\"TYP. NO. 15\",D6,0)","v":0},{"$f":"IF($T6=\"TRANS. TYP. NO. 1 TO TYP. NO. 15\",$D6,IF($T6=\"TRANS. TYP. NO. 15 TO TYP. NO. 1\",$D6,0))","v":0},{"$f":"IF($T6=\"TRANS. TYP. NO. 2 TO TYP. NO. 15\",$D6,IF($T6=\"TRANS. TYP. NO. 15 TO TYP. NO. 2\",$D6,0))","v":0},{"$f":"IF($T6=\"TRANS. TYP. NO. 3 TO TYP. NO. 15\",$D6,IF($T6=\"TRANS. TYP. NO. 15 TO TYP. NO. 3\",$D6,0))","v":0},{"$f":"IF($T6=\"TRANS. TYP. NO. 4 TO TYP. NO. 15\",$D6,IF($T6=\"TRANS. TYP. NO. 15 TO TYP. NO. 4\",$D6,0))","v":0},{"$f":"IF($T6=\"TRANS. TYP. NO. 5 TO TYP. NO. 15\",$D6,IF($T6=\"TRANS. TYP. NO. 15 TO TYP. NO. 5\",$D6,0))","v":0},{"$f":"IF($T6=\"TRANS. TYP. NO. 6 TO TYP. NO. 15\",$D6,IF($T6=\"TRANS. TYP. NO. 15 TO TYP. NO. 6\",$D6,0))","v":0},{"$f":"IF($T6=\"TRANS. TYP. NO. 7 TO TYP. NO. 15\",$D6,IF($T6=\"TRANS. TYP. NO. 15 TO TYP. NO. 7\",$D6,0))","v":0},{"$f":"IF($T6=\"TRANS. TYP. NO. 8 TO TYP. NO. 15\",$D6,IF($T6=\"TRANS. TYP. NO. 15 TO TYP. NO. 8\",$D6,0))","v":0},{"$f":"IF($T6=\"TRANS. TYP. NO. 9 TO TYP. NO. 15\",$D6,IF($T6=\"TRANS. TYP. NO. 15 TO TYP. NO. 9\",$D6,0))","v":0},{"$f":"IF($T6=\"TRANS. TYP. NO. 10 TO TYP. NO. 15\",$D6,IF($T6=\"TRANS. TYP. NO. 15 TO TYP. NO. 10\",$D6,0))","v":0},{"$f":"IF($T6=\"TRANS. TYP. NO. 11 TO TYP. NO. 15\",$D6,IF($T6=\"TRANS. TYP. NO. 15 TO TYP. NO. 11\",$D6,0))","v":0},{"$f":"IF($T6=\"TRANS. TYP. NO. 12 TO TYP. NO. 15\",$D6,IF($T6=\"TRANS. TYP. NO. 15 TO TYP. NO. 12\",$D6,0))","v":0},{"$f":"IF($T6=\"TRANS. TYP. NO. 13 TO TYP. NO. 15\",$D6,IF($T6=\"TRANS. TYP. NO. 15 TO TYP. NO. 13\",$D6,0))","v":0},{"$f":"IF($T6=\"TRANS. TYP. NO. 14 TO TYP. NO. 15\",$D6,IF($T6=\"TRANS. TYP. NO. 15 TO TYP. NO. 14\",$D6,0))","v":0},{"$f":"IF(T6=\"TYP. NO. 16\",D6,0)","v":0},{"$f":"IF($T6=\"TRANS. TYP. NO. 1 TO TYP. NO. 16\",$D6,IF($T6=\"TRANS. TYP. NO. 16 TO TYP. NO. 1\",$D6,0))","v":0},{"$f":"IF($T6=\"TRANS. TYP. NO. 2 TO TYP. NO. 16\",$D6,IF($T6=\"TRANS. TYP. NO. 16 TO TYP. NO. 2\",$D6,0))","v":0},{"$f":"IF($T6=\"TRANS. TYP. NO. 3 TO TYP. NO. 16\",$D6,IF($T6=\"TRANS. TYP. NO. 16 TO TYP. NO. 3\",$D6,0))","v":0},{"$f":"IF($T6=\"TRANS. TYP. NO. 4 TO TYP. NO. 16\",$D6,IF($T6=\"TRANS. TYP. NO. 16 TO TYP. NO. 4\",$D6,0))","v":0},{"$f":"IF($T6=\"TRANS. TYP. NO. 5 TO TYP. NO. 16\",$D6,IF($T6=\"TRANS. TYP. NO. 16 TO TYP. NO. 5\",$D6,0))","v":0},{"$f":"IF($T6=\"TRANS. TYP. NO. 6 TO TYP. NO. 16\",$D6,IF($T6=\"TRANS. TYP. NO. 16 TO TYP. NO. 6\",$D6,0))","v":0},{"$f":"IF($T6=\"TRANS. TYP. NO. 7 TO TYP. NO. 16\",$D6,IF($T6=\"TRANS. TYP. NO. 16 TO TYP. NO. 7\",$D6,0))","v":0},{"$f":"IF($T6=\"TRANS. TYP. NO. 8 TO TYP. NO. 16\",$D6,IF($T6=\"TRANS. TYP. NO. 16 TO TYP. NO. 8\",$D6,0))","v":0},{"$f":"IF($T6=\"TRANS. TYP. NO. 9 TO TYP. NO. 16\",$D6,IF($T6=\"TRANS. TYP. NO. 16 TO TYP. NO. 9\",$D6,0))","v":0},{"$f":"IF($T6=\"TRANS. TYP. NO. 10 TO TYP. NO. 16\",$D6,IF($T6=\"TRANS. TYP. NO. 16 TO TYP. NO. 10\",$D6,0))","v":0},{"$f":"IF($T6=\"TRANS. TYP. NO. 11 TO TYP. NO. 16\",$D6,IF($T6=\"TRANS. TYP. NO. 16 TO TYP. NO. 11\",$D6,0))","v":0},{"$f":"IF($T6=\"TRANS. TYP. NO. 12 TO TYP. NO. 16\",$D6,IF($T6=\"TRANS. TYP. NO. 16 TO TYP. NO. 12\",$D6,0))","v":0},{"$f":"IF($T6=\"TRANS. TYP. NO. 13 TO TYP. NO. 16\",$D6,IF($T6=\"TRANS. TYP. NO. 16 TO TYP. NO. 13\",$D6,0))","v":0},{"$f":"IF($T6=\"TRANS. TYP. NO. 14 TO TYP. NO. 16\",$D6,IF($T6=\"TRANS. TYP. NO. 16 TO TYP. NO. 14\",$D6,0))","v":0},{"$f":"IF($T6=\"TRANS. TYP. NO. 15 TO TYP. NO. 16\",$D6,IF($T6=\"TRANS. TYP. NO. 16 TO TYP. NO. 15\",$D6,0))","v":0}]
[1120.07,1132.51,{"$f":"IF(AND(A7=0,B7=0),\"\",IF(OR(G7=\"BRIDGE\",G8=\"BRIDGE\"),\"\",IF(G6=\"BRIDGE\",B7-A5,B7-A7)))","v":12.440000000000055},{"$f":"IF(C7=\"\",\"\",IF(G6=\"BRIDGE\",C7+E6-F6,IF(C7+E7-F7=0,\"\",C7+E7-F7)))","v":""},null,{"$f":"B7-A7","v":12.440000000000055},"Railroad",null,{"$f":"IF(OR($G7=\"BRIDGE\",$G8=\"BRIDGE\"),\"\",IF(AND($D7=\"\",$A7>0,$B7>0),\"~\",IF(W7=\"ERROR\",\"\",IF(W7=0,\"\",ROUND(W7*$D7/100,0)))))","v":"~"},{"$f":"IF(OR($G7=\"BRIDGE\",$G8=\"BRIDGE\"),\"\",IF(AND($D7=\"\",$A7>0,$B7>0),\"~\",IF(X7=\"ERROR\",\"\",IF(X7=0,\"\",ROUND(X7*$D7/100,0)))))","v":"~"},{"$f":"IF(OR($G7=\"BRIDGE\",$G8=\"BRIDGE\"),\"\",IF(AND($D7=\"\",$A7>0,$B7>0),\"~\",IF(Y7=\"ERROR\",\"\",IF(Y7=0,\"\",ROUND(Y7*$D7/100,0)))))","v":"~"},{"$f":"IF(OR($G7=\"BRIDGE\",$G8=\"BRIDGE\"),\"\",IF(AND($D7=\"\",$A7>0,$B7>0),\"~\",IF(Z7=\"ERROR\",\"\",IF(Z7=0,\"\",ROUND(Z7*$D7/100,0)))))","v":"~"},{"$f":"IF(OR($G7=\"BRIDGE\",$G8=\"BRIDGE\"),\"\",IF(AND($D7=\"\",$A7>0,$B7>0),\"~\",IF(AA7=\"ERROR\",\"\",IF(AA7=0,\"\",ROUND(AA7*$D7/100,0)))))","v":"~"},{"$f":"IF(OR($G7=\"BRIDGE\",$G8=\"BRIDGE\"),\"\",IF(AND($D7=\"\",$A7>0,$B7>0),\"~\",IF(AB7=\"ERROR\",\"\",IF(AB7=0,\"\",ROUND(AB7*$D7/100,0)))))","v":"~"},{"$f":"IF(OR($G7=\"BRIDGE\",$G8=\"BRIDGE\"),\"\",IF(AND($D7=\"\",$A7>0,$B7>0),\"~\",IF(AC7=\"ERROR\",\"\",IF(AC7=0,\"\",ROUND(AC7*$D7/100,1)))))","v":"~"},{"$f":"IF(OR($G7=\"BRIDGE\",$G8=\"BRIDGE\"),\"\",IF(AND($D7=\"\",$A7>0,$B7>0),\"~\",IF(AD7=\"ERROR\",\"\",IF(AD7=0,\"\",ROUND(AD7*$D7/100,1)))))","v":"~"},{"$f":"IF(OR($G7=\"BRIDGE\",$G8=\"BRIDGE\"),\"\",IF(AND($D7=\"\",$A7>0,$B7>0),\"~\",IF(AE7=\"ERROR\",\"\",IF(AE7=0,\"\",ROUND(AE7*$D7/100,0)))))","v":"~"},{"$f":"IF(OR($G7=\"BRIDGE\",$G8=\"BRIDGE\"),\"\",IF(AND($D7=\"\",$A7>0,$B7>0),\"~\",IF(AF7=\"ERROR\",\"\",IF(AF7=0,\"\",ROUND(AF7*$D7/100,0)))))","v":"~"},{"$f":"IF(OR($G7=\"BRIDGE\",$G8=\"BRIDGE\"),\"\",IF(AND($D7=\"\",$A7>0,$B7>0),\"~\",IF(AG7=\"ERROR\",\"\",IF(AG7=0,\"\",ROUND(AG7*$D7/100,0)))))","v":"~"},null,null,{"$f":"IF(T7=\"\",402,MATCH(T7,'Lookup Values'!$B$1:$B$402,0))","v":402},{"$f":"LOOKUP($V7,'Lookup Values'!$A$2:$A$402,'Lookup Values'!C$2:C$402)","v":"ERROR"},{"$f":"LOOKUP($V7,'Lookup Values'!$A$2:$A$402,'Lookup Values'!D$2:D$402)","v":"ERROR"},{"$f":"LOOKUP($V7,'Lookup Values'!$A$2:$A$402,'Lookup Values'!E$2:E$402)","v":"ERROR"},{"$f":"LOOKUP($V7,'Lookup Values'!$A$2:$A$402,'Lookup Values'!F$2:F$402)","v":"ERROR"},{"$f":"LOOKUP($V7,'Lookup Values'!$A$2:$A$402,'Lookup Values'!G$2:G$402)","v":"ERROR"},{"$f":"LOOKUP($V7,'Lookup Values'!$A$2:$A$402,'Lookup Values'!H$2:H$402)","v":"ERROR"},{"$f":"LOOKUP($V7,'Lookup Values'!$A$2:$A$402,'Lookup Values'!I$2:I$402)","v":"ERROR"},{"$f":"LOOKUP($V7,'Lookup Values'!$A$2:$A$402,'Lookup Values'!J$2:J$402)","v":"ERROR"},{"$f":"LOOKUP($V7,'Lookup Values'!$A$2:$A$402,'Lookup Values'!K$2:K$402)","v":"ERROR"},{"$f":"LOOKUP($V7,'Lookup Values'!$A$2:$A$402,'Lookup Values'!L$2:L$402)","v":"ERROR"},{"$f":"LOOKUP($V7,'Lookup Values'!$A$2:$A$402,'Lookup Values'!M$2:M$402)","v":"ERROR"},null,0,0,0,0,0,0,0,0,0,0,0,0,0,0,0,0,0,0,0,0,0,0,0,0,0,0,0,0,0,0,0,0,0,0,0,0,0,0,0,0,0,0,0,0,0,0,0,0,0,0,0,0,0,0,0,0,0,0,0,0,0,0,0,0,0,0,0,0,0,0,0,0,0,0,0,0,0,0,0,0,0,0,0,0,0,0,0,0,0,0,0,0,0,0,0,0,0,0,0,0,0,0,0,0,0,0,0,0,0,0,0,0,0,0,0,0,0,0,0,0,0,0,0,0,0,0,0,0,0,0,0,0,0,0,0,0]
[1132.51,1332.51,200,200,null,null,null,null,712,146,263,"","","",7.9,1.3,800,80,54,"TYP. NO. 1",null,{"$f":"IF(T8=\"\",402,MATCH(T8,'Lookup Values'!$B$1:$B$402,0))","v":2},{"$f":"LOOKUP($V8,'Lookup Values'!$A$2:$A$402,'Lookup Values'!C$2:C$402)","v":356},{"$f":"LOOKUP($V8,'Lookup Values'!$A$2:$A$402,'Lookup Values'!D$2:D$402)","v":72.900000000000006},{"$f":"LOOKUP($V8,'Lookup Values'!$A$2:$A$402,'Lookup Values'!E$2:E$402)","v":131.6},{"$f":"LOOKUP($V8,'Lookup Values'!$A$2:$A$402,'Lookup Values'!F$2:F$402)","v":0},{"$f":"LOOKUP($V8,'Lookup Values'!$A$2:$A$402,'Lookup Values'!G$2:G$402)","v":0},{"$f":"LOOKUP($V8,'Lookup Values'!$A$2:$A$402,'Lookup Values'!H$2:H$402)","v":0},{"$f":"LOOKUP($V8,'Lookup Values'!$A$2:$A$402,'Lookup Values'!I$2:I$402)","v":3.94},{"$f":"LOOKUP($V8,'Lookup Values'!$A$2:$A$402,'Lookup Values'!J$2:J$402)","v":0.64},{"$f":"LOOKUP($V8,'Lookup Values'!$A$2:$A$402,'Lookup Values'!K$2:K$402)","v":400},{"$f":"LOOKUP($V8,'Lookup Values'!$A$2:$A$402,'Lookup Values'!L$2:L$402)","v":40},{"$f":"LOOKUP($V8,'Lookup Values'!$A$2:$A$402,'Lookup Values'!M$2:M$402)","v":27},null,200,0,0,0,0,0,0,0,0,0,0,0,0,0,0,0,0,0,0,0,0,0,0,0,0,0,0,0,0,0,0,0,0,0,0,0,0,0,0,0,0,0,0,0,0,0,0,0,0,0,0,0,0,0,0,0,0,0,0,0,0,0,0,0,0,0,0,0,0,0,0,0,0,0,0,0,0,0,0,0,0,0,0,0,0,0,0,0,0,0,0,0,0,0,0,0,0,0,0,0,0,0,0,0,0,0,0,0,0,0,0,0,0,0,0,0,0,0,0,0,0,0,0,0,0,0,0,0,0,0,0,0,0,0,0,0]
[1332.51,1705.21,372.70000000000005,372.70000000000005,null,null,null,null,1327,271,474,"","","",14.6,2.4,1487,149,101,"TYP. NO. 2",null,{"$f":"IF(T9=\"\",402,MATCH(T9,'Lookup Values'!$B$1:$B$402,0))","v":3},{"$f":"LOOKUP($V9,'Lookup Values'!$A$2:$A$402,'Lookup Values'!C$2:C$402)","v":356},{"$f":"LOOKUP($V9,'Lookup Values'!$A$2:$A$402,'Lookup Values'!D$2:D$402)","v":72.7},{"$f":"LOOKUP($V9,'Lookup Values'!$A$2:$A$402,'Lookup Values'!E$2:E$402)","v":127.3},{"$f":"LOOKUP($V9,'Lookup Values'!$A$2:$A$402,'Lookup Values'!F$2:F$402)","v":0},{"$f":"LOOKUP($V9,'Lookup Values'!$A$2:$A$402,'Lookup Values'!G$2:G$402)","v":0},{"$f":"LOOKUP($V9,'Lookup Values'!$A$2:$A$402,'Lookup Values'!H$2:H$402)","v":0},{"$f":"LOOKUP($V9,'Lookup Values'!$A$2:$A$402,'Lookup Values'!I$2:I$402)","v":3.93},{"$f":"LOOKUP($V9,'Lookup Values'!$A$2:$A$402,'Lookup Values'!J$2:J$402)","v":0.64},{"$f":"LOOKUP($V9,'Lookup Values'!$A$2:$A$402,'Lookup Values'!K$2:K$402)","v":399},{"$f":"LOOKUP($V9,'Lookup Values'!$A$2:$A$402,'Lookup Values'!L$2:L$402)","v":40},{"$f":"LOOKUP($V9,'Lookup Values'!$A$2:$A$402,'Lookup Values'!M$2:M$402)","v":27},null,0,372.70000000000005,0,0,0,0,0,0,0,0,0,0,0,0,0,0,0,0,0,0,0,0,0,0,0,0,0,0,0,0,0,0,0,0,0,0,0,0,0,0,0,0,0,0,0,0,0,0,0,0,0,0,0,0,0,0,0,0,0,0,0,0,0,0,0,0,0,0,0,0,0,0,0,0,0,0,0,0,0,0,0,0,0,0,0,0,0,0,0,0,0,0,0,0,0,0,0,0,0,0,0,0,0,0,0,0,0,0,0,0,0,0,0,0,0,0,0,0,0,0,0,0,0,0,0,0,0,0,0,0,0,0,0,0,0,0]
[1705.21,1917.69,212.48000000000002,212.48000000000002,null,null,null,null,756,154,270,"","","",8.4,1.4,848,85,57,"TYP. NO. 2",null,{"$f":"IF(T10=\"\",402,MATCH(T10,'Lookup Values'!$B$1:$B$402,0))","v":3},{"$f":"LOOKUP($V10,'Lookup Values'!$A$2:$A$402,'Lookup Values'!C$2:C$402)","v":356},{"$f":"LOOKUP($V10,'Lookup Values'!$A$2:$A$402,'Lookup Values'!D$2:D$402)","v":72.7},{"$f":"LOOKUP($V10,'Lookup Values'!$A$2:$A$402,'Lookup Values'!E$2:E$402)","v":127.3},{"$f":"LOOKUP($V10,'Lookup Values'!$A$2:$A$402,'Lookup Values'!F$2:F$402)","v":0},{"$f":"LOOKUP($V10,'Lookup Values'!$A$2:$A$402,'Lookup Values'!G$2:G$402)","v":0},{"$f":"LOOKUP($V10,'Lookup Values'!$A$2:$A$402,'Lookup Values'!H$2:H$402)","v":0},{"$f":"LOOKUP($V10,'Lookup Values'!$A$2:$A$402,'Lookup Values'!I$2:I$402)","v":3.93},{"$f":"LOOKUP($V10,'Lookup Values'!$A$2:$A$402,'Lookup Values'!J$2:J$402)","v":0.64},{"$f":"LOOKUP($V10,'Lookup Values'!$A$2:$A$402,'Lookup Values'!K$2:K$402)","v":399},{"$f":"LOOKUP($V10,'Lookup Values'!$A$2:$A$402,'Lookup Values'!L$2:L$402)","v":40},{"$f":"LOOKUP($V10,'Lookup Values'!$A$2:$A$402,'Lookup Values'!M$2:M$402)","v":27},null,0,212.48000000000002,0,0,0,0,0,0,0,0,0,0,0,0,0,0,0,0,0,0,0,0,0,0,0,0,0,0,0,0,0,0,0,0,0,0,0,0,0,0,0,0,0,0,0,0,0,0,0,0,0,0,0,0,0,0,0,0,0,0,0,0,0,0,0,0,0,0,0,0,0,0,0,0,0,0,0,0,0,0,0,0,0,0,0,0,0,0,0,0,0,0,0,0,0,0,0,0,0,0,0,0,0,0,0,0,0,0,0,0,0,0,0,0,0,0,0,0,0,0,0,0,0,0,0,0,0,0,0,0,0,0,0,0,0,0]
[1917.69,6433.45,4515.76,4515.76,null,null,null,null,"","","","","","","","","","","","TYP. NO. 3",null,{"$f":"IF(T11=\"\",402,MATCH(T11,'Lookup Values'!$B$1:$B$402,0))","v":4},{"$f":"LOOKUP($V11,'Lookup Values'!$A$2:$A$402,'Lookup Values'!C$2:C$402)","v":0},{"$f":"LOOKUP($V11,'Lookup Values'!$A$2:$A$402,'Lookup Values'!D$2:D$402)","v":0},{"$f":"LOOKUP($V11,'Lookup Values'!$A$2:$A$402,'Lookup Values'!E$2:E$402)","v":0},{"$f":"LOOKUP($V11,'Lookup Values'!$A$2:$A$402,'Lookup Values'!F$2:F$402)","v":0},{"$f":"LOOKUP($V11,'Lookup Values'!$A$2:$A$402,'Lookup Values'!G$2:G$402)","v":0},{"$f":"LOOKUP($V11,'Lookup Values'!$A$2:$A$402,'Lookup Values'!H$2:H$402)","v":0},{"$f":"LOOKUP($V11,'Lookup Values'!$A$2:$A$402,'Lookup Values'!I$2:I$402)","v":0},{"$f":"LOOKUP($V11,'Lookup Values'!$A$2:$A$402,'Lookup Values'!J$2:J$402)","v":0},{"$f":"LOOKUP($V11,'Lookup Values'!$A$2:$A$402,'Lookup Values'!K$2:K$402)","v":0},{"$f":"LOOKUP($V11,'Lookup Values'!$A$2:$A$402,'Lookup Values'!L$2:L$402)","v":0},{"$f":"LOOKUP($V11,'Lookup Values'!$A$2:$A$402,'Lookup Values'!M$2:M$402)","v":0},null,0,0,0,4515.76,0,0,0,0,0,0,0,0,0,0,0,0,0,0,0,0,0,0,0,0,0,0,0,0,0,0,0,0,0,0,0,0,0,0,0,0,0,0,0,0,0,0,0,0,0,0,0,0,0,0,0,0,0,0,0,0,0,0,0,0,0,0,0,0,0,0,0,0,0,0,0,0,0,0,0,0,0,0,0,0,0,0,0,0,0,0,0,0,0,0,0,0,0,0,0,0,0,0,0,0,0,0,0,0,0,0,0,0,0,0,0,0,0,0,0,0,0,0,0,0,0,0,0,0,0,0,0,0,0,0,0,0]
[6433.45,7479.85,1046.4000000000005,1046.4000000000005,null,null,null,null,3725,761,1332,"","","",41.1,6.7,4175,419,283,"TYP. NO. 2",null,{"$f":"IF(T12=\"\",402,MATCH(T12,'Lookup Values'!$B$1:$B$402,0))","v":3},{"$f":"LOOKUP($V12,'Lookup Values'!$A$2:$A$402,'Lookup Values'!C$2:C$402)","v":356},{"$f":"LOOKUP($V12,'Lookup Values'!$A$2:$A$402,'Lookup Values'!D$2:D$402)","v":72.7},{"$f":"LOOKUP($V12,'Lookup Values'!$A$2:$A$402,'Lookup Values'!E$2:E$402)","v":127.3},{"$f":"LOOKUP($V12,'Lookup Values'!$A$2:$A$402,'Lookup Values'!F$2:F$402)","v":0},{"$f":"LOOKUP($V12,'Lookup Values'!$A$2:$A$402,'Lookup Values'!G$2:G$402)","v":0},{"$f":"LOOKUP($V12,'Lookup Values'!$A$2:$A$402,'Lookup Values'!H$2:H$402)","v":0},{"$f":"LOOKUP($V12,'Lookup Values'!$A$2:$A$402,'Lookup Values'!I$2:I$402)","v":3.93},{"$f":"LOOKUP($V12,'Lookup Values'!$A$2:$A$402,'Lookup Values'!J$2:J$402)","v":0.64},{"$f":"LOOKUP($V12,'Lookup Values'!$A$2:$A$402,'Lookup Values'!K$2:K$402)","v":399},{"$f":"LOOKUP($V12,'Lookup Values'!$A$2:$A$402,'Lookup Values'!L$2:L$402)","v":40},{"$f":"LOOKUP($V12,'Lookup Values'!$A$2:$A$402,'Lookup Values'!M$2:M$402)","v":27},null,0,1046.4000000000005,0,0,0,0,0,0,0,0,0,0,0,0,0,0,0,0,0,0,0,0,0,0,0,0,0,0,0,0,0,0,0,0,0,0,0,0,0,0,0,0,0,0,0,0,0,0,0,0,0,0,0,0,0,0,0,0,0,0,0,0,0,0,0,0,0,0,0,0,0,0,0,0,0,0,0,0,0,0,0,0,0,0,0,0,0,0,0,0,0,0,0,0,0,0,0,0,0,0,0,0,0,0,0,0,0,0,0,0,0,0,0,0,0,0,0,0,0,0,0,0,0,0,0,0,0,0,0,0,0,0,0,0,0,0]
[7479.85,null,"","",null,null,null,null,"","","","","","","","","","","",null,null,{"$f":"IF(T13=\"\",402,MATCH(T13,'Lookup Values'!$B$1:$B$402,0))","v":402},{"$f":"LOOKUP($V13,'Lookup Values'!$A$2:$A$402,'Lookup Values'!C$2:C$402)","v":"ERROR"},{"$f":"LOOKUP($V13,'Lookup Values'!$A$2:$A$402,'Lookup Values'!D$2:D$402)","v":"ERROR"},{"$f":"LOOKUP($V13,'Lookup Values'!$A$2:$A$402,'Lookup Values'!E$2:E$402)","v":"ERROR"},{"$f":"LOOKUP($V13,'Lookup Values'!$A$2:$A$402,'Lookup Values'!F$2:F$402)","v":"ERROR"},{"$f":"LOOKUP($V13,'Lookup Values'!$A$2:$A$402,'Lookup Values'!G$2:G$402)","v":"ERROR"},{"$f":"LOOKUP($V13,'Lookup Values'!$A$2:$A$402,'Lookup Values'!H$2:H$402)","v":"ERROR"},{"$f":"LOOKUP($V13,'Lookup Values'!$A$2:$A$402,'Lookup Values'!I$2:I$402)","v":"ERROR"},{"$f":"LOOKUP($V13,'Lookup Values'!$A$2:$A$402,'Lookup Values'!J$2:J$402)","v":"ERROR"},{"$f":"LOOKUP($V13,'Lookup Values'!$A$2:$A$402,'Lookup Values'!K$2:K$402)","v":"ERROR"},{"$f":"LOOKUP($V13,'Lookup Values'!$A$2:$A$402,'Lookup Values'!L$2:L$402)","v":"ERROR"},{"$f":"LOOKUP($V13,'Lookup Values'!$A$2:$A$402,'Lookup Values'!M$2:M$402)","v":"ERROR"},null,0,0,0,0,0,0,0,0,0,0,0,0,0,0,0,0,0,0,0,0,0,0,0,0,0,0,0,0,0,0,0,0,0,0,0,0,0,0,0,0,0,0,0,0,0,0,0,0,0,0,0,0,0,0,0,0,0,0,0,0,0,0,0,0,0,0,0,0,0,0,0,0,0,0,0,0,0,0,0,0,0,0,0,0,0,0,0,0,0,0,0,0,0,0,0,0,0,0,0,0,0,0,0,0,0,0,0,0,0,0,0,0,0,0,0,0,0,0,0,0,0,0,0,0,0,0,0,0,0,0,0,0,0,0,0,0]
[7681.52,7754.48,"","",null,{"$f":"B14-A14","v":72.959999999999127},"Bridge",null,"","","","","","","","","","","","WILLIAMS COULEE",null,{"$f":"IF(T14=\"\",402,MATCH(T14,'Lookup Values'!$B$1:$B$402,0))","v":{"$error":"#N/A"}},{"$f":"LOOKUP($V14,'Lookup Values'!$A$2:$A$402,'Lookup Values'!C$2:C$402)","v":{"$error":"#N/A"}},{"$f":"LOOKUP($V14,'Lookup Values'!$A$2:$A$402,'Lookup Values'!D$2:D$402)","v":{"$error":"#N/A"}},{"$f":"LOOKUP($V14,'Lookup Values'!$A$2:$A$402,'Lookup Values'!E$2:E$402)","v":{"$error":"#N/A"}},{"$f":"LOOKUP($V14,'Lookup Values'!$A$2:$A$402,'Lookup Values'!F$2:F$402)","v":{"$error":"#N/A"}},{"$f":"LOOKUP($V14,'Lookup Values'!$A$2:$A$402,'Lookup Values'!G$2:G$402)","v":{"$error":"#N/A"}},{"$f":"LOOKUP($V14,'Lookup Values'!$A$2:$A$402,'Lookup Values'!H$2:H$402)","v":{"$error":"#N/A"}},{"$f":"LOOKUP($V14,'Lookup Values'!$A$2:$A$402,'Lookup Values'!I$2:I$402)","v":{"$error":"#N/A"}},{"$f":"LOOKUP($V14,'Lookup Values'!$A$2:$A$402,'Lookup Values'!J$2:J$402)","v":{"$error":"#N/A"}},{"$f":"LOOKUP($V14,'Lookup Values'!$A$2:$A$402,'Lookup Values'!K$2:K$402)","v":{"$error":"#N/A"}},{"$f":"LOOKUP($V14,'Lookup Values'!$A$2:$A$402,'Lookup Values'!L$2:L$402)","v":{"$error":"#N/A"}},{"$f":"LOOKUP($V14,'Lookup Values'!$A$2:$A$402,'Lookup Values'!M$2:M$402)","v":{"$error":"#N/A"}},null,0,0,0,0,0,0,0,0,0,0,0,0,0,0,0,0,0,0,0,0,0,0,0,0,0,0,0,0,0,0,0,0,0,0,0,0,0,0,0,0,0,0,0,0,0,0,0,0,0,0,0,0,0,0,0,0,0,0,0,0,0,0,0,0,0,0,0,0,0,0,0,0,0,0,0,0,0,0,0,0,0,0,0,0,0,0,0,0,0,0,0,0,0,0,0,0,0,0,0,0,0,0,0,0,0,0,0,0,0,0,0,0,0,0,0,0,0,0,0,0,0,0,0,0,0,0,0,0,0,0,0,0,0,0,0,0]
[null,7956.15,476.29999999999927,403.34000000000015,null,null,null,null,1436,294,531,"","","",15.9,2.6,1613,161,109,"TYP. NO. 1",null,{"$f":"IF(T15=\"\",402,MATCH(T15,'Lookup Values'!$B$1:$B$402,0))","v":2},{"$f":"LOOKUP($V15,'Lookup Values'!$A$2:$A$402,'Lookup Values'!C$2:C$402)","v":356},{"$f":"LOOKUP($V15,'Lookup Values'!$A$2:$A$402,'Lookup Values'!D$2:D$402)","v":72.900000000000006},{"$f":"LOOKUP($V15,'Lookup Values'!$A$2:$A$402,'Lookup Values'!E$2:E$402)","v":131.6},{"$f":"LOOKUP($V15,'Lookup Values'!$A$2:$A$402,'Lookup Values'!F$2:F$402)","v":0},{"$f":"LOOKUP($V15,'Lookup Values'!$A$2:$A$402,'Lookup Values'!G$2:G$402)","v":0},{"$f":"LOOKUP($V15,'Lookup Values'!$A$2:$A$402,'Lookup Values'!H$2:H$402)","v":0},{"$f":"LOOKUP($V15,'Lookup Values'!$A$2:$A$402,'Lookup Values'!I$2:I$402)","v":3.94},{"$f":"LOOKUP($V15,'Lookup Values'!$A$2:$A$402,'Lookup Values'!J$2:J$402)","v":0.64},{"$f":"LOOKUP($V15,'Lookup Values'!$A$2:$A$402,'Lookup Values'!K$2:K$402)","v":400},{"$f":"LOOKUP($V15,'Lookup Values'!$A$2:$A$402,'Lookup Values'!L$2:L$402)","v":40},{"$f":"LOOKUP($V15,'Lookup Values'!$A$2:$A$402,'Lookup Values'!M$2:M$402)","v":27},null,403.34000000000015,0,0,0,0,0,0,0,0,0,0,0,0,0,0,0,0,0,0,0,0,0,0,0,0,0,0,0,0,0,0,0,0,0,0,0,0,0,0,0,0,0,0,0,0,0,0,0,0,0,0,0,0,0,0,0,0,0,0,0,0,0,0,0,0,0,0,0,0,0,0,0,0,0,0,0,0,0,0,0,0,0,0,0,0,0,0,0,0,0,0,0,0,0,0,0,0,0,0,0,0,0,0,0,0,0,0,0,0,0,0,0,0,0,0,0,0,0,0,0,0,0,0,0,0,0,0,0,0,0,0,0,0,0,0,0]
[7956.15,9000,1043.8500000000004,1043.8500000000004,null,null,null,null,3716,759,1329,"","","",41,6.7,4165,418,282,"TYP. NO. 2",null,{"$f":"IF(T16=\"\",402,MATCH(T16,'Lookup Values'!$B$1:$B$402,0))","v":3},{"$f":"LOOKUP($V16,'Lookup Values'!$A$2:$A$402,'Lookup Values'!C$2:C$402)","v":356},{"$f":"LOOKUP($V16,'Lookup Values'!$A$2:$A$402,'Lookup Values'!D$2:D$402)","v":72.7},{"$f":"LOOKUP($V16,'Lookup Values'!$A$2:$A$402,'Lookup Values'!E$2:E$402)","v":127.3},{"$f":"LOOKUP($V16,'Lookup Values'!$A$2:$A$402,'Lookup Values'!F$2:F$402)","v":0},{"$f":"LOOKUP($V16,'Lookup Values'!$A$2:$A$402,'Lookup Values'!G$2:G$402)","v":0},{"$f":"LOOKUP($V16,'Lookup Values'!$A$2:$A$402,'Lookup Values'!H$2:H$402)","v":0},{"$f":"LOOKUP($V16,'Lookup Values'!$A$2:$A$402,'Lookup Values'!I$2:I$402)","v":3.93},{"$f":"LOOKUP($V16,'Lookup Values'!$A$2:$A$402,'Lookup Values'!J$2:J$402)","v":0.64},{"$f":"LOOKUP($V16,'Lookup Values'!$A$2:$A$402,'Lookup Values'!K$2:K$402)","v":399},{"$f":"LOOKUP($V16,'Lookup Values'!$A$2:$A$402,'Lookup Values'!L$2:L$402)","v":40},{"$f":"LOOKUP($V16,'Lookup Values'!$A$2:$A$402,'Lookup Values'!M$2:M$402)","v":27},null,0,1043.8500000000004,0,0,0,0,0,0,0,0,0,0,0,0,0,0,0,0,0,0,0,0,0,0,0,0,0,0,0,0,0,0,0,0,0,0,0,0,0,0,0,0,0,0,0,0,0,0,0,0,0,0,0,0,0,0,0,0,0,0,0,0,0,0,0,0,0,0,0,0,0,0,0,0,0,0,0,0,0,0,0,0,0,0,0,0,0,0,0,0,0,0,0,0,0,0,0,0,0,0,0,0,0,0,0,0,0,0,0,0,0,0,0,0,0,0,0,0,0,0,0,0,0,0,0,0,0,0,0,0,0,0,0,0,0,0]
[9000,19622.89,10622.89,10622.89,null,null,null,null,"","","","","","","","","","","","TYP. NO. 3",null,{"$f":"IF(T17=\"\",402,MATCH(T17,'Lookup Values'!$B$1:$B$402,0))","v":4},{"$f":"LOOKUP($V17,'Lookup Values'!$A$2:$A$402,'Lookup Values'!C$2:C$402)","v":0},{"$f":"LOOKUP($V17,'Lookup Values'!$A$2:$A$402,'Lookup Values'!D$2:D$402)","v":0},{"$f":"LOOKUP($V17,'Lookup Values'!$A$2:$A$402,'Lookup Values'!E$2:E$402)","v":0},{"$f":"LOOKUP($V17,'Lookup Values'!$A$2:$A$402,'Lookup Values'!F$2:F$402)","v":0},{"$f":"LOOKUP($V17,'Lookup Values'!$A$2:$A$402,'Lookup Values'!G$2:G$402)","v":0},{"$f":"LOOKUP($V17,'Lookup Values'!$A$2:$A$402,'Lookup Values'!H$2:H$402)","v":0},{"$f":"LOOKUP($V17,'Lookup Values'!$A$2:$A$402,'Lookup Values'!I$2:I$402)","v":0},{"$f":"LOOKUP($V17,'Lookup Values'!$A$2:$A$402,'Lookup Values'!J$2:J$402)","v":0},{"$f":"LOOKUP($V17,'Lookup Values'!$A$2:$A$402,'Lookup Values'!K$2:K$402)","v":0},{"$f":"LOOKUP($V17,'Lookup Values'!$A$2:$A$402,'Lookup Values'!L$2:L$402)","v":0},{"$f":"LOOKUP($V17,'Lookup Values'!$A$2:$A$402,'Lookup Values'!M$2:M$402)","v":0},null,0,0,0,10622.89,0,0,0,0,0,0,0,0,0,0,0,0,0,0,0,0,0,0,0,0,0,0,0,0,0,0,0,0,0,0,0,0,0,0,0,0,0,0,0,0,0,0,0,0,0,0,0,0,0,0,0,0,0,0,0,0,0,0,0,0,0,0,0,0,0,0,0,0,0,0,0,0,0,0,0,0,0,0,0,0,0,0,0,0,0,0,0,0,0,0,0,0,0,0,0,0,0,0,0,0,0,0,0,0,0,0,0,0,0,0,0,0,0,0,0,0,0,0,0,0,0,0,0,0,0,0,0,0,0,0,0,0]
[19622.89,26502,6879.1100000000006,6879.1100000000006,null,null,null,null,24490,5001,8757,"","","",270.3,44,27448,2752,1857,"TYP. NO. 2",null,{"$f":"IF(T18=\"\",402,MATCH(T18,'Lookup Values'!$B$1:$B$402,0))","v":3},{"$f":"LOOKUP($V18,'Lookup Values'!$A$2:$A$402,'Lookup Values'!C$2:C$402)","v":356},{"$f":"LOOKUP($V18,'Lookup Values'!$A$2:$A$402,'Lookup Values'!D$2:D$402)","v":72.7},{"$f":"LOOKUP($V18,'Lookup Values'!$A$2:$A$402,'Lookup Values'!E$2:E$402)","v":127.3},{"$f":"LOOKUP($V18,'Lookup Values'!$A$2:$A$402,'Lookup Values'!F$2:F$402)","v":0},{"$f":"LOOKUP($V18,'Lookup Values'!$A$2:$A$402,'Lookup Values'!G$2:G$402)","v":0},{"$f":"LOOKUP($V18,'Lookup Values'!$A$2:$A$402,'Lookup Values'!H$2:H$402)","v":0},{"$f":"LOOKUP($V18,'Lookup Values'!$A$2:$A$402,'Lookup Values'!I$2:I$402)","v":3.93},{"$f":"LOOKUP($V18,'Lookup Values'!$A$2:$A$402,'Lookup Values'!J$2:J$402)","v":0.64},{"$f":"LOOKUP($V18,'Lookup Values'!$A$2:$A$402,'Lookup Values'!K$2:K$402)","v":399},{"$f":"LOOKUP($V18,'Lookup Values'!$A$2:$A$402,'Lookup Values'!L$2:L$402)","v":40},{"$f":"LOOKUP($V18,'Lookup Values'!$A$2:$A$402,'Lookup Values'!M$2:M$402)","v":27},null,0,6879.1100000000006,0,0,0,0,0,0,0,0,0,0,0,0,0,0,0,0,0,0,0,0,0,0,0,0,0,0,0,0,0,0,0,0,0,0,0,0,0,0,0,0,0,0,0,0,0,0,0,0,0,0,0,0,0,0,0,0,0,0,0,0,0,0,0,0,0,0,0,0,0,0,0,0,0,0,0,0,0,0,0,0,0,0,0,0,0,0,0,0,0,0,0,0,0,0,0,0,0,0,0,0,0,0,0,0,0,0,0,0,0,0,0,0,0,0,0,0,0,0,0,0,0,0,0,0,0,0,0,0,0,0,0,0,0,0]
[26502,26519,17,17,null,null,null,null,30,6,11,"","","",0.3,0.1,34,3,2,"TRANS. TYP. NO. 2 TO TYP. NO. 6",null,{"$f":"IF(T19=\"\",402,MATCH(T19,'Lookup Values'!$B$1:$B$402,0))","v":45},{"$f":"LOOKUP($V19,'Lookup Values'!$A$2:$A$402,'Lookup Values'!C$2:C$402)","v":178},{"$f":"LOOKUP($V19,'Lookup Values'!$A$2:$A$402,'Lookup Values'!D$2:D$402)","v":36.35},{"$f":"LOOKUP($V19,'Lookup Values'!$A$2:$A$402,'Lookup Values'!E$2:E$402)","v":63.65},{"$f":"LOOKUP($V19,'Lookup Values'!$A$2:$A$402,'Lookup Values'!F$2:F$402)","v":0},{"$f":"LOOKUP($V19,'Lookup Values'!$A$2:$A$402,'Lookup Values'!G$2:G$402)","v":0},{"$f":"LOOKUP($V19,'Lookup Values'!$A$2:$A$402,'Lookup Values'!H$2:H$402)","v":0},{"$f":"LOOKUP($V19,'Lookup Values'!$A$2:$A$402,'Lookup Values'!I$2:I$402)","v":1.9650000000000001},{"$f":"LOOKUP($V19,'Lookup Values'!$A$2:$A$402,'Lookup Values'!J$2:J$402)","v":0.32},{"$f":"LOOKUP($V19,'Lookup Values'!$A$2:$A$402,'Lookup Values'!K$2:K$402)","v":199.5},{"$f":"LOOKUP($V19,'Lookup Values'!$A$2:$A$402,'Lookup Values'!L$2:L$402)","v":20},{"$f":"LOOKUP($V19,'Lookup Values'!$A$2:$A$402,'Lookup Values'!M$2:M$402)","v":13.5},null,0,0,0,0,0,0,0,0,0,0,0,0,0,0,0,0,0,17,0,0,0,0,0,0,0,0,0,0,0,0,0,0,0,0,0,0,0,0,0,0,0,0,0,0,0,0,0,0,0,0,0,0,0,0,0,0,0,0,0,0,0,0,0,0,0,0,0,0,0,0,0,0,0,0,0,0,0,0,0,0,0,0,0,0,0,0,0,0,0,0,0,0,0,0,0,0,0,0,0,0,0,0,0,0,0,0,0,0,0,0,0,0,0,0,0,0,0,0,0,0,0,0,0,0,0,0,0,0,0,0,0,0,0,0,0,0]
[26519,null,"","",null,null,null,null,"","","","","","","","","","","",null,null,{"$f":"IF(T20=\"\",402,MATCH(T20,'Lookup Values'!$B$1:$B$402,0))","v":402},{"$f":"LOOKUP($V20,'Lookup Values'!$A$2:$A$402,'Lookup Values'!C$2:C$402)","v":"ERROR"},{"$f":"LOOKUP($V20,'Lookup Values'!$A$2:$A$402,'Lookup Values'!D$2:D$402)","v":"ERROR"},{"$f":"LOOKUP($V20,'Lookup Values'!$A$2:$A$402,'Lookup Values'!E$2:E$402)","v":"ERROR"},{"$f":"LOOKUP($V20,'Lookup Values'!$A$2:$A$402,'Lookup Values'!F$2:F$402)","v":"ERROR"},{"$f":"LOOKUP($V20,'Lookup Values'!$A$2:$A$402,'Lookup Values'!G$2:G$402)","v":"ERROR"},{"$f":"LOOKUP($V20,'Lookup Values'!$A$2:$A$402,'Lookup Values'!H$2:H$402)","v":"ERROR"},{"$f":"LOOKUP($V20,'Lookup Values'!$A$2:$A$402,'Lookup Values'!I$2:I$402)","v":"ERROR"},{"$f":"LOOKUP($V20,'Lookup Values'!$A$2:$A$402,'Lookup Values'!J$2:J$402)","v":"ERROR"},{"$f":"LOOKUP($V20,'Lookup Values'!$A$2:$A$402,'Lookup Values'!K$2:K$402)","v":"ERROR"},{"$f":"LOOKUP($V20,'Lookup Values'!$A$2:$A$402,'Lookup Values'!L$2:L$402)","v":"ERROR"},{"$f":"LOOKUP($V20,'Lookup Values'!$A$2:$A$402,'Lookup Values'!M$2:M$402)","v":"ERROR"},null,0,0,0,0,0,0,0,0,0,0,0,0,0,0,0,0,0,0,0,0,0,0,0,0,0,0,0,0,0,0,0,0,0,0,0,0,0,0,0,0,0,0,0,0,0,0,0,0,0,0,0,0,0,0,0,0,0,0,0,0,0,0,0,0,0,0,0,0,0,0,0,0,0,0,0,0,0,0,0,0,0,0,0,0,0,0,0,0,0,0,0,0,0,0,0,0,0,0,0,0,0,0,0,0,0,0,0,0,0,0,0,0,0,0,0,0,0,0,0,0,0,0,0,0,0,0,0,0,0,0,0,0,0,0,0,0]
[26755.52,26814.16,"","",null,{"$f":"B21-A21","v":58.639999999999418},"Bridge",null,"","","","","","","","","","","","TWO LEGGINS CANAL",null,{"$f":"IF(T21=\"\",402,MATCH(T21,'Lookup Values'!$B$1:$B$402,0))","v":{"$error":"#N/A"}},{"$f":"LOOKUP($V21,'Lookup Values'!$A$2:$A$402,'Lookup Values'!C$2:C$402)","v":{"$error":"#N/A"}},{"$f":"LOOKUP($V21,'Lookup Values'!$A$2:$A$402,'Lookup Values'!D$2:D$402)","v":{"$error":"#N/A"}},{"$f":"LOOKUP($V21,'Lookup Values'!$A$2:$A$402,'Lookup Values'!E$2:E$402)","v":{"$error":"#N/A"}},{"$f":"LOOKUP($V21,'Lookup Values'!$A$2:$A$402,'Lookup Values'!F$2:F$402)","v":{"$error":"#N/A"}},{"$f":"LOOKUP($V21,'Lookup Values'!$A$2:$A$402,'Lookup Values'!G$2:G$402)","v":{"$error":"#N/A"}},{"$f":"LOOKUP($V21,'Lookup Values'!$A$2:$A$402,'Lookup Values'!H$2:H$402)","v":{"$error":"#N/A"}},{"$f":"LOOKUP($V21,'Lookup Values'!$A$2:$A$402,'Lookup Values'!I$2:I$402)","v":{"$error":"#N/A"}},{"$f":"LOOKUP($V21,'Lookup Values'!$A$2:$A$402,'Lookup Values'!J$2:J$402)","v":{"$error":"#N/A"}},{"$f":"LOOKUP($V21,'Lookup Values'!$A$2:$A$402,'Lookup Values'!K$2:K$402)","v":{"$error":"#N/A"}},{"$f":"LOOKUP($V21,'Lookup Values'!$A$2:$A$402,'Lookup Values'!L$2:L$402)","v":{"$error":"#N/A"}},{"$f":"LOOKUP($V21,'Lookup Values'!$A$2:$A$402,'Lookup Values'!M$2:M$402)","v":{"$error":"#N/A"}},null,0,0,0,0,0,0,0,0,0,0,0,0,0,0,0,0,0,0,0,0,0,0,0,0,0,0,0,0,0,0,0,0,0,0,0,0,0,0,0,0,0,0,0,0,0,0,0,0,0,0,0,0,0,0,0,0,0,0,0,0,0,0,0,0,0,0,0,0,0,0,0,0,0,0,0,0,0,0,0,0,0,0,0,0,0,0,0,0,0,0,0,0,0,0,0,0,0,0,0,0,0,0,0,0,0,0,0,0,0,0,0,0,0,0,0,0,0,0,0,0,0,0,0,0,0,0,0,0,0,0,0,0,0,0,0,0]
[null,27051,532,473.36000000000058,null,null,null,null,"","","","","","","","","","","","TYP. NO. 7",null,{"$f":"IF(T22=\"\",402,MATCH(T22,'Lookup Values'!$B$1:$B$402,0))","v":8},{"$f":"LOOKUP($V22,'Lookup Values'!$A$2:$A$402,'Lookup Values'!C$2:C$402)","v":0},{"$f":"LOOKUP($V22,'Lookup Values'!$A$2:$A$402,'Lookup Values'!D$2:D$402)","v":0},{"$f":"LOOKUP($V22,'Lookup Values'!$A$2:$A$402,'Lookup Values'!E$2:E$402)","v":0},{"$f":"LOOKUP($V22,'Lookup Values'!$A$2:$A$402,'Lookup Values'!F$2:F$402)","v":0},{"$f":"LOOKUP($V22,'Lookup Values'!$A$2:$A$402,'Lookup Values'!G$2:G$402)","v":0},{"$f":"LOOKUP($V22,'Lookup Values'!$A$2:$A$402,'Lookup Values'!H$2:H$402)","v":0},{"$f":"LOOKUP($V22,'Lookup Values'!$A$2:$A$402,'Lookup Values'!I$2:I$402)","v":0},{"$f":"LOOKUP($V22,'Lookup Values'!$A$2:$A$402,'Lookup Values'!J$2:J$402)","v":0},{"$f":"LOOKUP($V22,'Lookup Values'!$A$2:$A$402,'Lookup Values'!K$2:K$402)","v":0},{"$f":"LOOKUP($V22,'Lookup Values'!$A$2:$A$402,'Lookup Values'!L$2:L$402)","v":0},{"$f":"LOOKUP($V22,'Lookup Values'!$A$2:$A$402,'Lookup Values'!M$2:M$402)","v":0},null,0,0,0,0,0,0,0,0,0,0,0,0,0,0,0,0,0,0,0,0,0,473.36000000000058,0,0,0,0,0,0,0,0,0,0,0,0,0,0,0,0,0,0,0,0,0,0,0,0,0,0,0,0,0,0,0,0,0,0,0,0,0,0,0,0,0,0,0,0,0,0,0,0,0,0,0,0,0,0,0,0,0,0,0,0,0,0,0,0,0,0,0,0,0,0,0,0,0,0,0,0,0,0,0,0,0,0,0,0,0,0,0,0,0,0,0,0,0,0,0,0,0,0,0,0,0,0,0,0,0,0,0,0,0,0,0,0,0,0]
[27051,27068,17,17,null,null,null,null,30,6,11,"","","",0.3,0.1,34,3,2,"TRANS. TYP. NO. 6 TO TYP. NO. 2",null,{"$f":"IF(T23=\"\",402,MATCH(T23,'Lookup Values'!$B$1:$B$402,0))","v":118},{"$f":"LOOKUP($V23,'Lookup Values'!$A$2:$A$402,'Lookup Values'!C$2:C$402)","v":178},{"$f":"LOOKUP($V23,'Lookup Values'!$A$2:$A$402,'Lookup Values'!D$2:D$402)","v":36.35},{"$f":"LOOKUP($V23,'Lookup Values'!$A$2:$A$402,'Lookup Values'!E$2:E$402)","v":63.65},{"$f":"LOOKUP($V23,'Lookup Values'!$A$2:$A$402,'Lookup Values'!F$2:F$402)","v":0},{"$f":"LOOKUP($V23,'Lookup Values'!$A$2:$A$402,'Lookup Values'!G$2:G$402)","v":0},{"$f":"LOOKUP($V23,'Lookup Values'!$A$2:$A$402,'Lookup Values'!H$2:H$402)","v":0},{"$f":"LOOKUP($V23,'Lookup Values'!$A$2:$A$402,'Lookup Values'!I$2:I$402)","v":1.9650000000000001},{"$f":"LOOKUP($V23,'Lookup Values'!$A$2:$A$402,'Lookup Values'!J$2:J$402)","v":0.32},{"$f":"LOOKUP($V23,'Lookup Values'!$A$2:$A$402,'Lookup Values'!K$2:K$402)","v":199.5},{"$f":"LOOKUP($V23,'Lookup Values'!$A$2:$A$402,'Lookup Values'!L$2:L$402)","v":20},{"$f":"LOOKUP($V23,'Lookup Values'!$A$2:$A$402,'Lookup Values'!M$2:M$402)","v":13.5},null,0,0,0,0,0,0,0,0,0,0,0,0,0,0,0,0,0,17,0,0,0,0,0,0,0,0,0,0,0,0,0,0,0,0,0,0,0,0,0,0,0,0,0,0,0,0,0,0,0,0,0,0,0,0,0,0,0,0,0,0,0,0,0,0,0,0,0,0,0,0,0,0,0,0,0,0,0,0,0,0,0,0,0,0,0,0,0,0,0,0,0,0,0,0,0,0,0,0,0,0,0,0,0,0,0,0,0,0,0,0,0,0,0,0,0,0,0,0,0,0,0,0,0,0,0,0,0,0,0,0,0,0,0,0,0,0]
[27068,34217.919999999998,7149.9199999999983,7149.9199999999983,null,null,null,null,25454,5198,9102,"","","",281,45.8,28528,2860,1930,"TYP. NO. 2",null,{"$f":"IF(T24=\"\",402,MATCH(T24,'Lookup Values'!$B$1:$B$402,0))","v":3},{"$f":"LOOKUP($V24,'Lookup Values'!$A$2:$A$402,'Lookup Values'!C$2:C$402)","v":356},{"$f":"LOOKUP($V24,'Lookup Values'!$A$2:$A$402,'Lookup Values'!D$2:D$402)","v":72.7},{"$f":"LOOKUP($V24,'Lookup Values'!$A$2:$A$402,'Lookup Values'!E$2:E$402)","v":127.3},{"$f":"LOOKUP($V24,'Lookup Values'!$A$2:$A$402,'Lookup Values'!F$2:F$402)","v":0},{"$f":"LOOKUP($V24,'Lookup Values'!$A$2:$A$402,'Lookup Values'!G$2:G$402)","v":0},{"$f":"LOOKUP($V24,'Lookup Values'!$A$2:$A$402,'Lookup Values'!H$2:H$402)","v":0},{"$f":"LOOKUP($V24,'Lookup Values'!$A$2:$A$402,'Lookup Values'!I$2:I$402)","v":3.93},{"$f":"LOOKUP($V24,'Lookup Values'!$A$2:$A$402,'Lookup Values'!J$2:J$402)","v":0.64},{"$f":"LOOKUP($V24,'Lookup Values'!$A$2:$A$402,'Lookup Values'!K$2:K$402)","v":399},{"$f":"LOOKUP($V24,'Lookup Values'!$A$2:$A$402,'Lookup Values'!L$2:L$402)","v":40},{"$f":"LOOKUP($V24,'Lookup Values'!$A$2:$A$402,'Lookup Values'!M$2:M$402)","v":27},null,0,7149.9199999999983,0,0,0,0,0,0,0,0,0,0,0,0,0,0,0,0,0,0,0,0,0,0,0,0,0,0,0,0,0,0,0,0,0,0,0,0,0,0,0,0,0,0,0,0,0,0,0,0,0,0,0,0,0,0,0,0,0,0,0,0,0,0,0,0,0,0,0,0,0,0,0,0,0,0,0,0,0,0,0,0,0,0,0,0,0,0,0,0,0,0,0,0,0,0,0,0,0,0,0,0,0,0,0,0,0,0,0,0,0,0,0,0,0,0,0,0,0,0,0,0,0,0,0,0,0,0,0,0,0,0,0,0,0,0]
[34217.919999999998,34317.919999999998,100,100,null,null,null,null,178,36,64,"","","",2,0.3,200,20,14,"TRANS. TYP. NO. 2 TO TYP. NO. 8",null,{"$f":"IF(T25=\"\",402,MATCH(T25,'Lookup Values'!$B$1:$B$402,0))","v":47},{"$f":"LOOKUP($V25,'Lookup Values'!$A$2:$A$402,'Lookup Values'!C$2:C$402)","v":178},{"$f":"LOOKUP($V25,'Lookup Values'!$A$2:$A$402,'Lookup Values'!D$2:D$402)","v":36.35},{"$f":"LOOKUP($V25,'Lookup Values'!$A$2:$A$402,'Lookup Values'!E$2:E$402)","v":63.65},{"$f":"LOOKUP($V25,'Lookup Values'!$A$2:$A$402,'Lookup Values'!F$2:F$402)","v":0},{"$f":"LOOKUP($V25,'Lookup Values'!$A$2:$A$402,'Lookup Values'!G$2:G$402)","v":0},{"$f":"LOOKUP($V25,'Lookup Values'!$A$2:$A$402,'Lookup Values'!H$2:H$402)","v":0},{"$f":"LOOKUP($V25,'Lookup Values'!$A$2:$A$402,'Lookup Values'!I$2:I$402)","v":1.9650000000000001},{"$f":"LOOKUP($V25,'Lookup Values'!$A$2:$A$402,'Lookup Values'!J$2:J$402)","v":0.32},{"$f":"LOOKUP($V25,'Lookup Values'!$A$2:$A$402,'Lookup Values'!K$2:K$402)","v":199.5},{"$f":"LOOKUP($V25,'Lookup Values'!$A$2:$A$402,'Lookup Values'!L$2:L$402)","v":20},{"$f":"LOOKUP($V25,'Lookup Values'!$A$2:$A$402,'Lookup Values'!M$2:M$402)","v":13.5},null,0,0,0,0,0,0,0,0,0,0,0,0,0,0,0,0,0,0,0,0,0,0,0,0,0,0,0,0,0,0,100,0,0,0,0,0,0,0,0,0,0,0,0,0,0,0,0,0,0,0,0,0,0,0,0,0,0,0,0,0,0,0,0,0,0,0,0,0,0,0,0,0,0,0,0,0,0,0,0,0,0,0,0,0,0,0,0,0,0,0,0,0,0,0,0,0,0,0,0,0,0,0,0,0,0,0,0,0,0,0,0,0,0,0,0,0,0,0,0,0,0,0,0,0,0,0,0,0,0,0,0,0,0,0,0,0]
[null,null,"","",null,null,null,null,"","","","","","","","","","","",null,null,{"$f":"IF(T26=\"\",402,MATCH(T26,'Lookup Values'!$B$1:$B$402,0))","v":402},{"$f":"LOOKUP($V26,'Lookup Values'!$A$2:$A$402,'Lookup Values'!C$2:C$402)","v":"ERROR"},{"$f":"LOOKUP($V26,'Lookup Values'!$A$2:$A$402,'Lookup Values'!D$2:D$402)","v":"ERROR"},{"$f":"LOOKUP($V26,'Lookup Values'!$A$2:$A$402,'Lookup Values'!E$2:E$402)","v":"ERROR"},{"$f":"LOOKUP($V26,'Lookup Values'!$A$2:$A$402,'Lookup Values'!F$2:F$402)","v":"ERROR"},{"$f":"LOOKUP($V26,'Lookup Values'!$A$2:$A$402,'Lookup Values'!G$2:G$402)","v":"ERROR"},{"$f":"LOOKUP($V26,'Lookup Values'!$A$2:$A$402,'Lookup Values'!H$2:H$402)","v":"ERROR"},{"$f":"LOOKUP($V26,'Lookup Values'!$A$2:$A$402,'Lookup Values'!I$2:I$402)","v":"ERROR"},{"$f":"LOOKUP($V26,'Lookup Values'!$A$2:$A$402,'Lookup Values'!J$2:J$402)","v":"ERROR"},{"$f":"LOOKUP($V26,'Lookup Values'!$A$2:$A$402,'Lookup Values'!K$2:K$402)","v":"ERROR"},{"$f":"LOOKUP($V26,'Lookup Values'!$A$2:$A$402,'Lookup Values'!L$2:L$402)","v":"ERROR"},{"$f":"LOOKUP($V26,'Lookup Values'!$A$2:$A$402,'Lookup Values'!M$2:M$402)","v":"ERROR"},null,0,0,0,0,0,0,0,0,0,0,0,0,0,0,0,0,0,0,0,0,0,0,0,0,0,0,0,0,0,0,0,0,0,0,0,0,0,0,0,0,0,0,0,0,0,0,0,0,0,0,0,0,0,0,0,0,0,0,0,0,0,0,0,0,0,0,0,0,0,0,0,0,0,0,0,0,0,0,0,0,0,0,0,0,0,0,0,0,0,0,0,0,0,0,0,0,0,0,0,0,0,0,0,0,0,0,0,0,0,0,0,0,0,0,0,0,0,0,0,0,0,0,0,0,0,0,0,0,0,0,0,0,0,0,0,0]
[null,null,{"$f":"IF(AND(A27=0,B27=0),\"\",IF(OR(G27=\"BRIDGE\",G28=\"BRIDGE\"),\"\",IF(G26=\"BRIDGE\",B27-A25,B27-A27)))","v":""},{"$f":"IF(C27=\"\",\"\",IF(G26=\"BRIDGE\",C27+E26-F26,IF(C27+E27-F27=0,\"\",C27+E27-F27)))","v":""},null,null,null,null,"","","","","","","","","","","",null,null,{"$f":"IF(T27=\"\",402,MATCH(T27,'Lookup Values'!$B$1:$B$402,0))","v":402},{"$f":"LOOKUP($V27,'Lookup Values'!$A$2:$A$402,'Lookup Values'!C$2:C$402)","v":"ERROR"},{"$f":"LOOKUP($V27,'Lookup Values'!$A$2:$A$402,'Lookup Values'!D$2:D$402)","v":"ERROR"},{"$f":"LOOKUP($V27,'Lookup Values'!$A$2:$A$402,'Lookup Values'!E$2:E$402)","v":"ERROR"},{"$f":"LOOKUP($V27,'Lookup Values'!$A$2:$A$402,'Lookup Values'!F$2:F$402)","v":"ERROR"},{"$f":"LOOKUP($V27,'Lookup Values'!$A$2:$A$402,'Lookup Values'!G$2:G$402)","v":"ERROR"},{"$f":"LOOKUP($V27,'Lookup Values'!$A$2:$A$402,'Lookup Values'!H$2:H$402)","v":"ERROR"},{"$f":"LOOKUP($V27,'Lookup Values'!$A$2:$A$402,'Lookup Values'!I$2:I$402)","v":"ERROR"},{"$f":"LOOKUP($V27,'Lookup Values'!$A$2:$A$402,'Lookup Values'!J$2:J$402)","v":"ERROR"},{"$f":"LOOKUP($V27,'Lookup Values'!$A$2:$A$402,'Lookup Values'!K$2:K$402)","v":"ERROR"},{"$f":"LOOKUP($V27,'Lookup Values'!$A$2:$A$402,'Lookup Values'!L$2:L$402)","v":"ERROR"},{"$f":"LOOKUP($V27,'Lookup Values'!$A$2:$A$402,'Lookup Values'!M$2:M$402)","v":"ERROR"},null,0,0,0,0,0,0,0,0,0,0,0,0,0,0,0,0,0,0,0,0,0,0,0,0,0,0,0,0,0,0,0,0,0,0,0,0,0,0,0,0,0,0,0,0,0,0,0,0,0,0,0,0,0,0,0,0,0,0,0,0,0,0,0,0,0,0,0,0,0,0,0,0,0,0,0,0,0,0,0,0,0,0,0,0,0,0,0,0,0,0,0,0,0,0,0,0,0,0,0,0,0,0,0,0,0,0,0,0,0,0,0,0,0,0,0,0,0,0,0,0,0,0,0,0,0,0,0,0,0,0,0,0,0,0,0,0]
[null,null,"","",null,null,null,null,"","","","","","","","","","","",null,null,{"$f":"IF(T28=\"\",402,MATCH(T28,'Lookup Values'!$B$1:$B$402,0))","v":402},{"$f":"LOOKUP($V28,'Lookup Values'!$A$2:$A$402,'Lookup Values'!C$2:C$402)","v":"ERROR"},{"$f":"LOOKUP($V28,'Lookup Values'!$A$2:$A$402,'Lookup Values'!D$2:D$402)","v":"ERROR"},{"$f":"LOOKUP($V28,'Lookup Values'!$A$2:$A$402,'Lookup Values'!E$2:E$402)","v":"ERROR"},{"$f":"LOOKUP($V28,'Lookup Values'!$A$2:$A$402,'Lookup Values'!F$2:F$402)","v":"ERROR"},{"$f":"LOOKUP($V28,'Lookup Values'!$A$2:$A$402,'Lookup Values'!G$2:G$402)","v":"ERROR"},{"$f":"LOOKUP($V28,'Lookup Values'!$A$2:$A$402,'Lookup Values'!H$2:H$402)","v":"ERROR"},{"$f":"LOOKUP($V28,'Lookup Values'!$A$2:$A$402,'Lookup Values'!I$2:I$402)","v":"ERROR"},{"$f":"LOOKUP($V28,'Lookup Values'!$A$2:$A$402,'Lookup Values'!J$2:J$402)","v":"ERROR"},{"$f":"LOOKUP($V28,'Lookup Values'!$A$2:$A$402,'Lookup Values'!K$2:K$402)","v":"ERROR"},{"$f":"LOOKUP($V28,'Lookup Values'!$A$2:$A$402,'Lookup Values'!L$2:L$402)","v":"ERROR"},{"$f":"LOOKUP($V28,'Lookup Values'!$A$2:$A$402,'Lookup Values'!M$2:M$402)","v":"ERROR"},null,0,0,0,0,0,0,0,0,0,0,0,0,0,0,0,0,0,0,0,0,0,0,0,0,0,0,0,0,0,0,0,0,0,0,0,0,0,0,0,0,0,0,0,0,0,0,0,0,0,0,0,0,0,0,0,0,0,0,0,0,0,0,0,0,0,0,0,0,0,0,0,0,0,0,0,0,0,0,0,0,0,0,0,0,0,0,0,0,0,0,0,0,0,0,0,0,0,0,0,0,0,0,0,0,0,0,0,0,0,0,0,0,0,0,0,0,0,0,0,0,0,0,0,0,0,0,0,0,0,0,0,0,0,0,0,0]
[null,null,"","",null,null,null,null,"","","","","","","","","","","",null,null,{"$f":"IF(T29=\"\",402,MATCH(T29,'Lookup Values'!$B$1:$B$402,0))","v":402},{"$f":"LOOKUP($V29,'Lookup Values'!$A$2:$A$402,'Lookup Values'!C$2:C$402)","v":"ERROR"},{"$f":"LOOKUP($V29,'Lookup Values'!$A$2:$A$402,'Lookup Values'!D$2:D$402)","v":"ERROR"},{"$f":"LOOKUP($V29,'Lookup Values'!$A$2:$A$402,'Lookup Values'!E$2:E$402)","v":"ERROR"},{"$f":"LOOKUP($V29,'Lookup Values'!$A$2:$A$402,'Lookup Values'!F$2:F$402)","v":"ERROR"},{"$f":"LOOKUP($V29,'Lookup Values'!$A$2:$A$402,'Lookup Values'!G$2:G$402)","v":"ERROR"},{"$f":"LOOKUP($V29,'Lookup Values'!$A$2:$A$402,'Lookup Values'!H$2:H$402)","v":"ERROR"},{"$f":"LOOKUP($V29,'Lookup Values'!$A$2:$A$402,'Lookup Values'!I$2:I$402)","v":"ERROR"},{"$f":"LOOKUP($V29,'Lookup Values'!$A$2:$A$402,'Lookup Values'!J$2:J$402)","v":"ERROR"},{"$f":"LOOKUP($V29,'Lookup Values'!$A$2:$A$402,'Lookup Values'!K$2:K$402)","v":"ERROR"},{"$f":"LOOKUP($V29,'Lookup Values'!$A$2:$A$402,'Lookup Values'!L$2:L$402)","v":"ERROR"},{"$f":"LOOKUP($V29,'Lookup Values'!$A$2:$A$402,'Lookup Values'!M$2:M$402)","v":"ERROR"},null,0,0,0,0,0,0,0,0,0,0,0,0,0,0,0,0,0,0,0,0,0,0,0,0,0,0,0,0,0,0,0,0,0,0,0,0,0,0,0,0,0,0,0,0,0,0,0,0,0,0,0,0,0,0,0,0,0,0,0,0,0,0,0,0,0,0,0,0,0,0,0,0,0,0,0,0,0,0,0,0,0,0,0,0,0,0,0,0,0,0,0,0,0,0,0,0,0,0,0,0,0,0,0,0,0,0,0,0,0,0,0,0,0,0,0,0,0,0,0,0,0,0,0,0,0,0,0,0,0,0,0,0,0,0,0,0]
[null,null,"","",null,null,null,null,"","","","","","","","","","","",null,null,{"$f":"IF(T30=\"\",402,MATCH(T30,'Lookup Values'!$B$1:$B$402,0))","v":402},{"$f":"LOOKUP($V30,'Lookup Values'!$A$2:$A$402,'Lookup Values'!C$2:C$402)","v":"ERROR"},{"$f":"LOOKUP($V30,'Lookup Values'!$A$2:$A$402,'Lookup Values'!D$2:D$402)","v":"ERROR"},{"$f":"LOOKUP($V30,'Lookup Values'!$A$2:$A$402,'Lookup Values'!E$2:E$402)","v":"ERROR"},{"$f":"LOOKUP($V30,'Lookup Values'!$A$2:$A$402,'Lookup Values'!F$2:F$402)","v":"ERROR"},{"$f":"LOOKUP($V30,'Lookup Values'!$A$2:$A$402,'Lookup Values'!G$2:G$402)","v":"ERROR"},{"$f":"LOOKUP($V30,'Lookup Values'!$A$2:$A$402,'Lookup Values'!H$2:H$402)","v":"ERROR"},{"$f":"LOOKUP($V30,'Lookup Values'!$A$2:$A$402,'Lookup Values'!I$2:I$402)","v":"ERROR"},{"$f":"LOOKUP($V30,'Lookup Values'!$A$2:$A$402,'Lookup Values'!J$2:J$402)","v":"ERROR"},{"$f":"LOOKUP($V30,'Lookup Values'!$A$2:$A$402,'Lookup Values'!K$2:K$402)","v":"ERROR"},{"$f":"LOOKUP($V30,'Lookup Values'!$A$2:$A$402,'Lookup Values'!L$2:L$402)","v":"ERROR"},{"$f":"LOOKUP($V30,'Lookup Values'!$A$2:$A$402,'Lookup Values'!M$2:M$402)","v":"ERROR"},null,0,0,0,0,0,0,0,0,0,0,0,0,0,0,0,0,0,0,0,0,0,0,0,0,0,0,0,0,0,0,0,0,0,0,0,0,0,0,0,0,0,0,0,0,0,0,0,0,0,0,0,0,0,0,0,0,0,0,0,0,0,0,0,0,0,0,0,0,0,0,0,0,0,0,0,0,0,0,0,0,0,0,0,0,0,0,0,0,0,0,0,0,0,0,0,0,0,0,0,0,0,0,0,0,0,0,0,0,0,0,0,0,0,0,0,0,0,0,0,0,0,0,0,0,0,0,0,0,0,0,0,0,0,0,0,0]
[null,null,"","",null,null,null,null,"","","","","","","","","","","",null,null,{"$f":"IF(T31=\"\",402,MATCH(T31,'Lookup Values'!$B$1:$B$402,0))","v":402},{"$f":"LOOKUP($V31,'Lookup Values'!$A$2:$A$402,'Lookup Values'!C$2:C$402)","v":"ERROR"},{"$f":"LOOKUP($V31,'Lookup Values'!$A$2:$A$402,'Lookup Values'!D$2:D$402)","v":"ERROR"},{"$f":"LOOKUP($V31,'Lookup Values'!$A$2:$A$402,'Lookup Values'!E$2:E$402)","v":"ERROR"},{"$f":"LOOKUP($V31,'Lookup Values'!$A$2:$A$402,'Lookup Values'!F$2:F$402)","v":"ERROR"},{"$f":"LOOKUP($V31,'Lookup Values'!$A$2:$A$402,'Lookup Values'!G$2:G$402)","v":"ERROR"},{"$f":"LOOKUP($V31,'Lookup Values'!$A$2:$A$402,'Lookup Values'!H$2:H$402)","v":"ERROR"},{"$f":"LOOKUP($V31,'Lookup Values'!$A$2:$A$402,'Lookup Values'!I$2:I$402)","v":"ERROR"},{"$f":"LOOKUP($V31,'Lookup Values'!$A$2:$A$402,'Lookup Values'!J$2:J$402)","v":"ERROR"},{"$f":"LOOKUP($V31,'Lookup Values'!$A$2:$A$402,'Lookup Values'!K$2:K$402)","v":"ERROR"},{"$f":"LOOKUP($V31,'Lookup Values'!$A$2:$A$402,'Lookup Values'!L$2:L$402)","v":"ERROR"},{"$f":"LOOKUP($V31,'Lookup Values'!$A$2:$A$402,'Lookup Values'!M$2:M$402)","v":"ERROR"},null,0,0,0,0,0,0,0,0,0,0,0,0,0,0,0,0,0,0,0,0,0,0,0,0,0,0,0,0,0,0,0,0,0,0,0,0,0,0,0,0,0,0,0,0,0,0,0,0,0,0,0,0,0,0,0,0,0,0,0,0,0,0,0,0,0,0,0,0,0,0,0,0,0,0,0,0,0,0,0,0,0,0,0,0,0,0,0,0,0,0,0,0,0,0,0,0,0,0,0,0,0,0,0,0,0,0,0,0,0,0,0,0,0,0,0,0,0,0,0,0,0,0,0,0,0,0,0,0,0,0,0,0,0,0,0,0]
[null,null,"","",null,null,null,null,"","","","","","","","","","","",null,null,{"$f":"IF(T32=\"\",402,MATCH(T32,'Lookup Values'!$B$1:$B$402,0))","v":402},{"$f":"LOOKUP($V32,'Lookup Values'!$A$2:$A$402,'Lookup Values'!C$2:C$402)","v":"ERROR"},{"$f":"LOOKUP($V32,'Lookup Values'!$A$2:$A$402,'Lookup Values'!D$2:D$402)","v":"ERROR"},{"$f":"LOOKUP($V32,'Lookup Values'!$A$2:$A$402,'Lookup Values'!E$2:E$402)","v":"ERROR"},{"$f":"LOOKUP($V32,'Lookup Values'!$A$2:$A$402,'Lookup Values'!F$2:F$402)","v":"ERROR"},{"$f":"LOOKUP($V32,'Lookup Values'!$A$2:$A$402,'Lookup Values'!G$2:G$402)","v":"ERROR"},{"$f":"LOOKUP($V32,'Lookup Values'!$A$2:$A$402,'Lookup Values'!H$2:H$402)","v":"ERROR"},{"$f":"LOOKUP($V32,'Lookup Values'!$A$2:$A$402,'Lookup Values'!I$2:I$402)","v":"ERROR"},{"$f":"LOOKUP($V32,'Lookup Values'!$A$2:$A$402,'Lookup Values'!J$2:J$402)","v":"ERROR"},{"$f":"LOOKUP($V32,'Lookup Values'!$A$2:$A$402,'Lookup Values'!K$2:K$402)","v":"ERROR"},{"$f":"LOOKUP($V32,'Lookup Values'!$A$2:$A$402,'Lookup Values'!L$2:L$402)","v":"ERROR"},{"$f":"LOOKUP($V32,'Lookup Values'!$A$2:$A$402,'Lookup Values'!M$2:M$402)","v":"ERROR"},null,0,0,0,0,0,0,0,0,0,0,0,0,0,0,0,0,0,0,0,0,0,0,0,0,0,0,0,0,0,0,0,0,0,0,0,0,0,0,0,0,0,0,0,0,0,0,0,0,0,0,0,0,0,0,0,0,0,0,0,0,0,0,0,0,0,0,0,0,0,0,0,0,0,0,0,0,0,0,0,0,0,0,0,0,0,0,0,0,0,0,0,0,0,0,0,0,0,0,0,0,0,0,0,0,0,0,0,0,0,0,0,0,0,0,0,0,0,0,0,0,0,0,0,0,0,0,0,0,0,0,0,0,0,0,0,0]
[null,null,"","",null,null,null,null,"","","","","","","","","","","",null,null,{"$f":"IF(T33=\"\",402,MATCH(T33,'Lookup Values'!$B$1:$B$402,0))","v":402},{"$f":"LOOKUP($V33,'Lookup Values'!$A$2:$A$402,'Lookup Values'!C$2:C$402)","v":"ERROR"},{"$f":"LOOKUP($V33,'Lookup Values'!$A$2:$A$402,'Lookup Values'!D$2:D$402)","v":"ERROR"},{"$f":"LOOKUP($V33,'Lookup Values'!$A$2:$A$402,'Lookup Values'!E$2:E$402)","v":"ERROR"},{"$f":"LOOKUP($V33,'Lookup Values'!$A$2:$A$402,'Lookup Values'!F$2:F$402)","v":"ERROR"},{"$f":"LOOKUP($V33,'Lookup Values'!$A$2:$A$402,'Lookup Values'!G$2:G$402)","v":"ERROR"},{"$f":"LOOKUP($V33,'Lookup Values'!$A$2:$A$402,'Lookup Values'!H$2:H$402)","v":"ERROR"},{"$f":"LOOKUP($V33,'Lookup Values'!$A$2:$A$402,'Lookup Values'!I$2:I$402)","v":"ERROR"},{"$f":"LOOKUP($V33,'Lookup Values'!$A$2:$A$402,'Lookup Values'!J$2:J$402)","v":"ERROR"},{"$f":"LOOKUP($V33,'Lookup Values'!$A$2:$A$402,'Lookup Values'!K$2:K$402)","v":"ERROR"},{"$f":"LOOKUP($V33,'Lookup Values'!$A$2:$A$402,'Lookup Values'!L$2:L$402)","v":"ERROR"},{"$f":"LOOKUP($V33,'Lookup Values'!$A$2:$A$402,'Lookup Values'!M$2:M$402)","v":"ERROR"},null,0,0,0,0,0,0,0,0,0,0,0,0,0,0,0,0,0,0,0,0,0,0,0,0,0,0,0,0,0,0,0,0,0,0,0,0,0,0,0,0,0,0,0,0,0,0,0,0,0,0,0,0,0,0,0,0,0,0,0,0,0,0,0,0,0,0,0,0,0,0,0,0,0,0,0,0,0,0,0,0,0,0,0,0,0,0,0,0,0,0,0,0,0,0,0,0,0,0,0,0,0,0,0,0,0,0,0,0,0,0,0,0,0,0,0,0,0,0,0,0,0,0,0,0,0,0,0,0,0,0,0,0,0,0,0,0]
[null,null,"","",null,null,null,null,"","","","","","","","","","","",null,null,{"$f":"IF(T34=\"\",402,MATCH(T34,'Lookup Values'!$B$1:$B$402,0))","v":402},{"$f":"LOOKUP($V34,'Lookup Values'!$A$2:$A$402,'Lookup Values'!C$2:C$402)","v":"ERROR"},{"$f":"LOOKUP($V34,'Lookup Values'!$A$2:$A$402,'Lookup Values'!D$2:D$402)","v":"ERROR"},{"$f":"LOOKUP($V34,'Lookup Values'!$A$2:$A$402,'Lookup Values'!E$2:E$402)","v":"ERROR"},{"$f":"LOOKUP($V34,'Lookup Values'!$A$2:$A$402,'Lookup Values'!F$2:F$402)","v":"ERROR"},{"$f":"LOOKUP($V34,'Lookup Values'!$A$2:$A$402,'Lookup Values'!G$2:G$402)","v":"ERROR"},{"$f":"LOOKUP($V34,'Lookup Values'!$A$2:$A$402,'Lookup Values'!H$2:H$402)","v":"ERROR"},{"$f":"LOOKUP($V34,'Lookup Values'!$A$2:$A$402,'Lookup Values'!I$2:I$402)","v":"ERROR"},{"$f":"LOOKUP($V34,'Lookup Values'!$A$2:$A$402,'Lookup Values'!J$2:J$402)","v":"ERROR"},{"$f":"LOOKUP($V34,'Lookup Values'!$A$2:$A$402,'Lookup Values'!K$2:K$402)","v":"ERROR"},{"$f":"LOOKUP($V34,'Lookup Values'!$A$2:$A$402,'Lookup Values'!L$2:L$402)","v":"ERROR"},{"$f":"LOOKUP($V34,'Lookup Values'!$A$2:$A$402,'Lookup Values'!M$2:M$402)","v":"ERROR"},null,0,0,0,0,0,0,0,0,0,0,0,0,0,0,0,0,0,0,0,0,0,0,0,0,0,0,0,0,0,0,0,0,0,0,0,0,0,0,0,0,0,0,0,0,0,0,0,0,0,0,0,0,0,0,0,0,0,0,0,0,0,0,0,0,0,0,0,0,0,0,0,0,0,0,0,0,0,0,0,0,0,0,0,0,0,0,0,0,0,0,0,0,0,0,0,0,0,0,0,0,0,0,0,0,0,0,0,0,0,0,0,0,0,0,0,0,0,0,0,0,0,0,0,0,0,0,0,0,0,0,0,0,0,0,0,0]
[null,null,"","",null,null,null,null,"","","","","","","","","","","",null,null,{"$f":"IF(T35=\"\",402,MATCH(T35,'Lookup Values'!$B$1:$B$402,0))","v":402},{"$f":"LOOKUP($V35,'Lookup Values'!$A$2:$A$402,'Lookup Values'!C$2:C$402)","v":"ERROR"},{"$f":"LOOKUP($V35,'Lookup Values'!$A$2:$A$402,'Lookup Values'!D$2:D$402)","v":"ERROR"},{"$f":"LOOKUP($V35,'Lookup Values'!$A$2:$A$402,'Lookup Values'!E$2:E$402)","v":"ERROR"},{"$f":"LOOKUP($V35,'Lookup Values'!$A$2:$A$402,'Lookup Values'!F$2:F$402)","v":"ERROR"},{"$f":"LOOKUP($V35,'Lookup Values'!$A$2:$A$402,'Lookup Values'!G$2:G$402)","v":"ERROR"},{"$f":"LOOKUP($V35,'Lookup Values'!$A$2:$A$402,'Lookup Values'!H$2:H$402)","v":"ERROR"},{"$f":"LOOKUP($V35,'Lookup Values'!$A$2:$A$402,'Lookup Values'!I$2:I$402)","v":"ERROR"},{"$f":"LOOKUP($V35,'Lookup Values'!$A$2:$A$402,'Lookup Values'!J$2:J$402)","v":"ERROR"},{"$f":"LOOKUP($V35,'Lookup Values'!$A$2:$A$402,'Lookup Values'!K$2:K$402)","v":"ERROR"},{"$f":"LOOKUP($V35,'Lookup Values'!$A$2:$A$402,'Lookup Values'!L$2:L$402)","v":"ERROR"},{"$f":"LOOKUP($V35,'Lookup Values'!$A$2:$A$402,'Lookup Values'!M$2:M$402)","v":"ERROR"},null,0,0,0,0,0,0,0,0,0,0,0,0,0,0,0,0,0,0,0,0,0,0,0,0,0,0,0,0,0,0,0,0,0,0,0,0,0,0,0,0,0,0,0,0,0,0,0,0,0,0,0,0,0,0,0,0,0,0,0,0,0,0,0,0,0,0,0,0,0,0,0,0,0,0,0,0,0,0,0,0,0,0,0,0,0,0,0,0,0,0,0,0,0,0,0,0,0,0,0,0,0,0,0,0,0,0,0,0,0,0,0,0,0,0,0,0,0,0,0,0,0,0,0,0,0,0,0,0,0,0,0,0,0,0,0,0,null,"Average Finish Top Width",{"$f":"IF((SUM(AI100:FN100)+SUM(#REF!))>0,ROUND((SUM(#REF!)+SUM(#REF!))/(SUM(AI100:FN100)+SUM(#REF!)),1),0)","v":{"$error":"#REF!"}},"ft"]
[null,null,"","",null,null,null,null,"","","","","","","","","","","",null,null,{"$f":"IF(T36=\"\",402,MATCH(T36,'Lookup Values'!$B$1:$B$402,0))","v":402},{"$f":"LOOKUP($V36,'Lookup Values'!$A$2:$A$402,'Lookup Values'!C$2:C$402)","v":"ERROR"},{"$f":"LOOKUP($V36,'Lookup Values'!$A$2:$A$402,'Lookup Values'!D$2:D$402)","v":"ERROR"},{"$f":"LOOKUP($V36,'Lookup Values'!$A$2:$A$402,'Lookup Values'!E$2:E$402)","v":"ERROR"},{"$f":"LOOKUP($V36,'Lookup Values'!$A$2:$A$402,'Lookup Values'!F$2:F$402)","v":"ERROR"},{"$f":"LOOKUP($V36,'Lookup Values'!$A$2:$A$402,'Lookup Values'!G$2:G$402)","v":"ERROR"},{"$f":"LOOKUP($V36,'Lookup Values'!$A$2:$A$402,'Lookup Values'!H$2:H$402)","v":"ERROR"},{"$f":"LOOKUP($V36,'Lookup Values'!$A$2:$A$402,'Lookup Values'!I$2:I$402)","v":"ERROR"},{"$f":"LOOKUP($V36,'Lookup Values'!$A$2:$A$402,'Lookup Values'!J$2:J$402)","v":"ERROR"},{"$f":"LOOKUP($V36,'Lookup Values'!$A$2:$A$402,'Lookup Values'!K$2:K$402)","v":"ERROR"},{"$f":"LOOKUP($V36,'Lookup Values'!$A$2:$A$402,'Lookup Values'!L$2:L$402)","v":"ERROR"},{"$f":"LOOKUP($V36,'Lookup Values'!$A$2:$A$402,'Lookup Values'!M$2:M$402)","v":"ERROR"},null,0,0,0,0,0,0,0,0,0,0,0,0,0,0,0,0,0,0,0,0,0,0,0,0,0,0,0,0,0,0,0,0,0,0,0,0,0,0,0,0,0,0,0,0,0,0,0,0,0,0,0,0,0,0,0,0,0,0,0,0,0,0,0,0,0,0,0,0,0,0,0,0,0,0,0,0,0,0,0,0,0,0,0,0,0,0,0,0,0,0,0,0,0,0,0,0,0,0,0,0,0,0,0,0,0,0,0,0,0,0,0,0,0,0,0,0,0,0,0,0,0,0,0,0,0,0,0,0,0,0,0,0,0,0,0,0]
[null,null,"","",null,null,null,null,"","","","","","","","","","","",null,null,{"$f":"IF(T37=\"\",402,MATCH(T37,'Lookup Values'!$B$1:$B$402,0))","v":402},{"$f":"LOOKUP($V37,'Lookup Values'!$A$2:$A$402,'Lookup Values'!C$2:C$402)","v":"ERROR"},{"$f":"LOOKUP($V37,'Lookup Values'!$A$2:$A$402,'Lookup Values'!D$2:D$402)","v":"ERROR"},{"$f":"LOOKUP($V37,'Lookup Values'!$A$2:$A$402,'Lookup Values'!E$2:E$402)","v":"ERROR"},{"$f":"LOOKUP($V37,'Lookup Values'!$A$2:$A$402,'Lookup Values'!F$2:F$402)","v":"ERROR"},{"$f":"LOOKUP($V37,'Lookup Values'!$A$2:$A$402,'Lookup Values'!G$2:G$402)","v":"ERROR"},{"$f":"LOOKUP($V37,'Lookup Values'!$A$2:$A$402,'Lookup Values'!H$2:H$402)","v":"ERROR"},{"$f":"LOOKUP($V37,'Lookup Values'!$A$2:$A$402,'Lookup Values'!I$2:I$402)","v":"ERROR"},{"$f":"LOOKUP($V37,'Lookup Values'!$A$2:$A$402,'Lookup Values'!J$2:J$402)","v":"ERROR"},{"$f":"LOOKUP($V37,'Lookup Values'!$A$2:$A$402,'Lookup Values'!K$2:K$402)","v":"ERROR"},{"$f":"LOOKUP($V37,'Lookup Values'!$A$2:$A$402,'Lookup Values'!L$2:L$402)","v":"ERROR"},{"$f":"LOOKUP($V37,'Lookup Values'!$A$2:$A$402,'Lookup Values'!M$2:M$402)","v":"ERROR"},null,0,0,0,0,0,0,0,0,0,0,0,0,0,0,0,0,0,0,0,0,0,0,0,0,0,0,0,0,0,0,0,0,0,0,0,0,0,0,0,0,0,0,0,0,0,0,0,0,0,0,0,0,0,0,0,0,0,0,0,0,0,0,0,0,0,0,0,0,0,0,0,0,0,0,0,0,0,0,0,0,0,0,0,0,0,0,0,0,0,0,0,0,0,0,0,0,0,0,0,0,0,0,0,0,0,0,0,0,0,0,0,0,0,0,0,0,0,0,0,0,0,0,0,0,0,0,0,0,0,0,0,0,0,0,0,0]
[null,null,"","",null,null,null,null,"","","","","","","","","","","",null,null,{"$f":"IF(T38=\"\",402,MATCH(T38,'Lookup Values'!$B$1:$B$402,0))","v":402},{"$f":"LOOKUP($V38,'Lookup Values'!$A$2:$A$402,'Lookup Values'!C$2:C$402)","v":"ERROR"},{"$f":"LOOKUP($V38,'Lookup Values'!$A$2:$A$402,'Lookup Values'!D$2:D$402)","v":"ERROR"},{"$f":"LOOKUP($V38,'Lookup Values'!$A$2:$A$402,'Lookup Values'!E$2:E$402)","v":"ERROR"},{"$f":"LOOKUP($V38,'Lookup Values'!$A$2:$A$402,'Lookup Values'!F$2:F$402)","v":"ERROR"},{"$f":"LOOKUP($V38,'Lookup Values'!$A$2:$A$402,'Lookup Values'!G$2:G$402)","v":"ERROR"},{"$f":"LOOKUP($V38,'Lookup Values'!$A$2:$A$402,'Lookup Values'!H$2:H$402)","v":"ERROR"},{"$f":"LOOKUP($V38,'Lookup Values'!$A$2:$A$402,'Lookup Values'!I$2:I$402)","v":"ERROR"},{"$f":"LOOKUP($V38,'Lookup Values'!$A$2:$A$402,'Lookup Values'!J$2:J$402)","v":"ERROR"},{"$f":"LOOKUP($V38,'Lookup Values'!$A$2:$A$402,'Lookup Values'!K$2:K$402)","v":"ERROR"},{"$f":"LOOKUP($V38,'Lookup Values'!$A$2:$A$402,'Lookup Values'!L$2:L$402)","v":"ERROR"},{"$f":"LOOKUP($V38,'Lookup Values'!$A$2:$A$402,'Lookup Values'!M$2:M$402)","v":"ERROR"},null,{"$f":"IF(T38=\"TYP. NO. 1\",D38,0)","v":0},{"$f":"IF(T38=\"TYP. NO. 2\",D38,0)","v":0},{"$f":"IF(T38=\"TRANS. TYP. NO. 1 TO TYP. NO. 2\",D38,IF(T38=\"TRANS. TYP. NO. 2 TO TYP. NO. 1\",D38,0))","v":0},{"$f":"IF(T38=\"TYP. NO. 3\",D38,0)","v":0},{"$f":"IF(T38=\"TRANS. TYP. NO. 1 TO TYP. NO. 3\",D38,IF(T38=\"TRANS. TYP. NO. 3 TO TYP. NO. 1\",D38,0))","v":0},{"$f":"IF(T38=\"TRANS. TYP. NO. 2 TO TYP. NO. 3\",D38,IF(T38=\"TRANS. TYP. NO. 3 TO TYP. NO. 2\",D38,0))","v":0},{"$f":"IF(T38=\"TYP. NO. 4\",D38,0)","v":0},{"$f":"IF(T38=\"TRANS. TYP. NO. 1 TO TYP. NO. 4\",D38,IF(T38=\"TRANS. TYP. NO. 4 TO TYP. NO. 1\",D38,0))","v":0},{"$f":"IF(T38=\"TRANS. TYP. NO. 2 TO TYP. NO. 4\",D38,IF(T38=\"TRANS. TYP. NO. 4 TO TYP. NO. 2\",D38,0))","v":0},{"$f":"IF(T38=\"TRANS. TYP. NO. 3 TO TYP. NO. 4\",D38,IF(T38=\"TRANS. TYP. NO. 4 TO TYP. NO. 3\",D38,0))","v":0},{"$f":"IF(T38=\"TYP. NO. 5\",D38,0)","v":0},{"$f":"IF(T38=\"TRANS. TYP. NO. 1 TO TYP. NO. 5\",D38,IF(T38=\"TRANS. TYP. NO. 5 TO TYP. NO. 1\",D38,0))","v":0},{"$f":"IF(T38=\"TRANS. TYP. NO. 2 TO TYP. NO. 5\",D38,IF(T38=\"TRANS. TYP. NO. 5 TO TYP. NO. 2\",D38,0))","v":0},{"$f":"IF(T38=\"TRANS. TYP. NO. 3 TO TYP. NO. 5\",D38,IF(T38=\"TRANS. TYP. NO. 5 TO TYP. NO. 3\",D38,0))","v":0},{"$f":"IF(T38=\"TRANS. TYP. NO. 4 TO TYP. NO. 5\",D38,IF(T38=\"TRANS. TYP. NO. 5 TO TYP. NO. 4\",D38,0))","v":0},{"$f":"IF(T38=\"TYP. NO. 6\",D38,0)","v":0},{"$f":"IF(T38=\"TRANS. TYP. NO. 1 TO TYP. NO. 6\",D38,IF(T38=\"TRANS. TYP. NO. 6 TO TYP. NO. 1\",D38,0))","v":0},{"$f":"IF(T38=\"TRANS. TYP. NO. 2 TO TYP. NO. 6\",D38,IF(T38=\"TRANS. TYP. NO. 6 TO TYP. NO. 2\",D38,0))","v":0},{"$f":"IF(T38=\"TRANS. TYP. NO. 3 TO TYP. NO. 6\",D38,IF(T38=\"TRANS. TYP. NO. 6 TO TYP. NO. 3\",D38,0))","v":0},{"$f":"IF(T38=\"TRANS. TYP. NO. 4 TO TYP. NO. 6\",D38,IF(T38=\"TRANS. TYP. NO. 6 TO TYP. NO. 4\",D38,0))","v":0},{"$f":"IF(T38=\"TRANS. TYP. NO. 5 TO TYP. NO. 6\",D38,IF(T38=\"TRANS. TYP. NO. 6 TO TYP. NO. 5\",D38,0))","v":0},{"$f":"IF(T38=\"TYP. NO. 7\",D38,0)","v":0},{"$f":"IF(T38=\"TRANS. TYP. NO. 1 TO TYP. NO. 7\",D38,IF(T38=\"TRANS. TYP. NO. 7 TO TYP. NO. 1\",D38,0))","v":0},{"$f":"IF(T38=\"TRANS. TYP. NO. 2 TO TYP. NO. 7\",D38,IF(T38=\"TRANS. TYP. NO. 7 TO TYP. NO. 2\",D38,0))","v":0},{"$f":"IF(T38=\"TRANS. TYP. NO. 3 TO TYP. NO. 7\",D38,IF(T38=\"TRANS. TYP. NO. 7 TO TYP. NO. 3\",D38,0))","v":0},{"$f":"IF(T38=\"TRANS. TYP. NO. 4 TO TYP. NO. 7\",D38,IF(T38=\"TRANS. TYP. NO. 7 TO TYP. NO. 4\",D38,0))","v":0},{"$f":"IF(T38=\"TRANS. TYP. NO. 5 TO TYP. NO. 7\",D38,IF(T38=\"TRANS. TYP. NO. 7 TO TYP. NO. 5\",D38,0))","v":0},{"$f":"IF(T38=\"TRANS. TYP. NO. 6 TO TYP. NO. 7\",D38,IF(T38=\"TRANS. TYP. NO. 7 TO TYP. NO. 6\",D38,0))","v":0},{"$f":"IF(T38=\"TYP. NO. 8\",D38,0)","v":0},{"$f":"IF($T38=\"TRANS. TYP. NO. 1 TO TYP. NO. 8\",$D38,IF($T38=\"TRANS. TYP. NO. 8 TO TYP. NO. 1\",$D38,0))","v":0},{"$f":"IF($T38=\"TRANS. TYP. NO. 2 TO TYP. NO. 8\",$D38,IF($T38=\"TRANS. TYP. NO. 8 TO TYP. NO. 2\",$D38,0))","v":0},{"$f":"IF($T38=\"TRANS. TYP. NO. 3 TO TYP. NO. 8\",$D38,IF($T38=\"TRANS. TYP. NO. 8 TO TYP. NO. 3\",$D38,0))","v":0},{"$f":"IF($T38=\"TRANS. TYP. NO. 4 TO TYP. NO. 8\",$D38,IF($T38=\"TRANS. TYP. NO. 8 TO TYP. NO. 4\",$D38,0))","v":0},{"$f":"IF($T38=\"TRANS. TYP. NO. 5 TO TYP. NO. 8\",$D38,IF($T38=\"TRANS. TYP. NO. 8 TO TYP. NO. 5\",$D38,0))","v":0},{"$f":"IF($T38=\"TRANS. TYP. NO. 6 TO TYP. NO. 8\",$D38,IF($T38=\"TRANS. TYP. NO. 8 TO TYP. NO. 6\",$D38,0))","v":0},{"$f":"IF($T38=\"TRANS. TYP. NO. 7 TO TYP. NO. 8\",$D38,IF($T38=\"TRANS. TYP. NO. 8 TO TYP. NO. 7\",$D38,0))","v":0},{"$f":"IF(T38=\"TYP. NO. 9\",D38,0)","v":0},{"$f":"IF($T38=\"TRANS. TYP. NO. 1 TO TYP. NO. 9\",$D38,IF($T38=\"TRANS. TYP. NO. 9 TO TYP. NO. 1\",$D38,0))","v":0},{"$f":"IF($T38=\"TRANS. TYP. NO. 2 TO TYP. NO. 9\",$D38,IF($T38=\"TRANS. TYP. NO. 9 TO TYP. NO. 2\",$D38,0))","v":0},{"$f":"IF($T38=\"TRANS. TYP. NO. 3 TO TYP. NO. 9\",$D38,IF($T38=\"TRANS. TYP. NO. 9 TO TYP. NO. 3\",$D38,0))","v":0},{"$f":"IF($T38=\"TRANS. TYP. NO. 4 TO TYP. NO. 9\",$D38,IF($T38=\"TRANS. TYP. NO. 9 TO TYP. NO. 4\",$D38,0))","v":0},{"$f":"IF($T38=\"TRANS. TYP. NO. 5 TO TYP. NO. 9\",$D38,IF($T38=\"TRANS. TYP. NO. 9 TO TYP. NO. 5\",$D38,0))","v":0},{"$f":"IF($T38=\"TRANS. TYP. NO. 6 TO TYP. NO. 9\",$D38,IF($T38=\"TRANS. TYP. NO. 9 TO TYP. NO. 6\",$D38,0))","v":0},{"$f":"IF($T38=\"TRANS. TYP. NO. 7 TO TYP. NO. 9\",$D38,IF($T38=\"TRANS. TYP. NO. 9 TO TYP. NO. 7\",$D38,0))","v":0},{"$f":"IF($T38=\"TRANS. TYP. NO. 8 TO TYP. NO. 9\",$D38,IF($T38=\"TRANS. TYP. NO. 9 TO TYP. NO. 8\",$D38,0))","v":0},{"$f":"IF(T38=\"TYP. NO. 10\",D38,0)","v":0},{"$f":"IF($T38=\"TRANS. TYP. NO. 1 TO TYP. NO. 10\",$D38,IF($T38=\"TRANS. TYP. NO. 10 TO TYP. NO. 1\",$D38,0))","v":0},{"$f":"IF($T38=\"TRANS. TYP. NO. 2 TO TYP. NO. 10\",$D38,IF($T38=\"TRANS. TYP. NO. 10 TO TYP. NO. 2\",$D38,0))","v":0},{"$f":"IF($T38=\"TRANS. TYP. NO. 3 TO TYP. NO. 10\",$D38,IF($T38=\"TRANS. TYP. NO. 10 TO TYP. NO. 3\",$D38,0))","v":0},{"$f":"IF($T38=\"TRANS. TYP. NO. 4 TO TYP. NO. 10\",$D38,IF($T38=\"TRANS. TYP. NO. 10 TO TYP. NO. 4\",$D38,0))","v":0},{"$f":"IF($T38=\"TRANS. TYP. NO. 5 TO TYP. NO. 10\",$D38,IF($T38=\"TRANS. TYP. NO. 10 TO TYP. NO. 5\",$D38,0))","v":0},{"$f":"IF($T38=\"TRANS. TYP. NO. 6 TO TYP. NO. 10\",$D38,IF($T38=\"TRANS. TYP. NO. 10 TO TYP. NO. 6\",$D38,0))","v":0},{"$f":"IF($T38=\"TRANS. TYP. NO. 7 TO TYP. NO. 10\",$D38,IF($T38=\"TRANS. TYP. NO. 10 TO TYP. NO. 7\",$D38,0))","v":0},{"$f":"IF($T38=\"TRANS. TYP. NO. 8 TO TYP. NO. 10\",$D38,IF($T38=\"TRANS. TYP. NO. 10 TO TYP. NO. 8\",$D38,0))","v":0},{"$f":"IF($T38=\"TRANS. TYP. NO. 9 TO TYP. NO. 10\",$D38,IF($T38=\"TRANS. TYP. NO. 10 TO TYP. NO. 9\",$D38,0))","v":0},{"$f":"IF(T38=\"TYP. NO. 11\",D38,0)","v":0},{"$f":"IF($T38=\"TRANS. TYP. NO. 1 TO TYP. NO. 11\",$D38,IF($T38=\"TRANS. TYP. NO. 11 TO TYP. NO. 1\",$D38,0))","v":0},{"$f":"IF($T38=\"TRANS. TYP. NO. 2 TO TYP. NO. 11\",$D38,IF($T38=\"TRANS. TYP. NO. 11 TO TYP. NO. 2\",$D38,0))","v":0},{"$f":"IF($T38=\"TRANS. TYP. NO. 3 TO TYP. NO. 11\",$D38,IF($T38=\"TRANS. TYP. NO. 11 TO TYP. NO. 3\",$D38,0))","v":0},{"$f":"IF($T38=\"TRANS. TYP. NO. 4 TO TYP. NO. 11\",$D38,IF($T38=\"TRANS. TYP. NO. 11 TO TYP. NO. 4\",$D38,0))","v":0},{"$f":"IF($T38=\"TRANS. TYP. NO. 5 TO TYP. NO. 11\",$D38,IF($T38=\"TRANS. TYP. NO. 11 TO TYP. NO. 5\",$D38,0))","v":0},{"$f":"IF($T38=\"TRANS. TYP. NO. 6 TO TYP. NO. 11\",$D38,IF($T38=\"TRANS. TYP. NO. 11 TO TYP. NO. 6\",$D38,0))","v":0},{"$f":"IF($T38=\"TRANS. TYP. NO. 7 TO TYP. NO. 11\",$D38,IF($T38=\"TRANS. TYP. NO. 11 TO TYP. NO. 7\",$D38,0))","v":0},{"$f":"IF($T38=\"TRANS. TYP. NO. 8 TO TYP. NO. 11\",$D38,IF($T38=\"TRANS. TYP. NO. 11 TO TYP. NO. 8\",$D38,0))","v":0},{"$f":"IF($T38=\"TRANS. TYP. NO. 9 TO TYP. NO. 11\",$D38,IF($T38=\"TRANS. TYP. NO. 11 TO TYP. NO. 9\",$D38,0))","v":0},{"$f":"IF($T38=\"TRANS. TYP. NO. 10 TO TYP. NO. 11\",$D38,IF($T38=\"TRANS. TYP. NO. 11 TO TYP. NO. 10\",$D38,0))","v":0},{"$f":"IF(T38=\"TYP. NO. 12\",D38,0)","v":0},{"$f":"IF($T38=\"TRANS. TYP. NO. 1 TO TYP. NO. 12\",$D38,IF($T38=\"TRANS. TYP. NO. 12 TO TYP. NO. 1\",$D38,0))","v":0},{"$f":"IF($T38=\"TRANS. TYP. NO. 2 TO TYP. NO. 12\",$D38,IF($T38=\"TRANS. TYP. NO. 12 TO TYP. NO. 2\",$D38,0))","v":0},{"$f":"IF($T38=\"TRANS. TYP. NO. 3 TO TYP. NO. 12\",$D38,IF($T38=\"TRANS. TYP. NO. 12 TO TYP. NO. 3\",$D38,0))","v":0},{"$f":"IF($T38=\"TRANS. TYP. NO. 4 TO TYP. NO. 12\",$D38,IF($T38=\"TRANS. TYP. NO. 12 TO TYP. NO. 4\",$D38,0))","v":0},{"$f":"IF($T38=\"TRANS. TYP. NO. 5 TO TYP. NO. 12\",$D38,IF($T38=\"TRANS. TYP. NO. 12 TO TYP. NO. 5\",$D38,0))","v":0},{"$f":"IF($T38=\"TRANS. TYP. NO. 6 TO TYP. NO. 12\",$D38,IF($T38=\"TRANS. TYP. NO. 12 TO TYP. NO. 6\",$D38,0))","v":0},{"$f":"IF($T38=\"TRANS. TYP. NO. 7 TO TYP. NO. 12\",$D38,IF($T38=\"TRANS. TYP. NO. 12 TO TYP. NO. 7\",$D38,0))","v":0},{"$f":"IF($T38=\"TRANS. TYP. NO. 8 TO TYP. NO. 12\",$D38,IF($T38=\"TRANS. TYP. NO. 12 TO TYP. NO. 8\",$D38,0))","v":0},{"$f":"IF($T38=\"TRANS. TYP. NO. 9 TO TYP. NO. 12\",$D38,IF($T38=\"TRANS. TYP. NO. 12 TO TYP. NO. 9\",$D38,0))","v":0},{"$f":"IF($T38=\"TRANS. TYP. NO. 10 TO TYP. NO. 12\",$D38,IF($T38=\"TRANS. TYP. NO. 12 TO TYP. NO. 10\",$D38,0))","v":0},{"$f":"IF($T38=\"TRANS. TYP. NO. 11 TO TYP. NO. 12\",$D38,IF($T38=\"TRANS. TYP. NO. 12 TO TYP. NO. 11\",$D38,0))","v":0},{"$f":"IF(T38=\"TYP. NO. 13\",D38,0)","v":0},{"$f":"IF($T38=\"TRANS. TYP. NO. 1 TO TYP. NO. 13\",$D38,IF($T38=\"TRANS. TYP. NO. 13 TO TYP. NO. 1\",$D38,0))","v":0},{"$f":"IF($T38=\"TRANS. TYP. NO. 2 TO TYP. NO. 13\",$D38,IF($T38=\"TRANS. TYP. NO. 13 TO TYP. NO. 2\",$D38,0))","v":0},{"$f":"IF($T38=\"TRANS. TYP. NO. 3 TO TYP. NO. 13\",$D38,IF($T38=\"TRANS. TYP. NO. 13 TO TYP. NO. 3\",$D38,0))","v":0},{"$f":"IF($T38=\"TRANS. TYP. NO. 4 TO TYP. NO. 13\",$D38,IF($T38=\"TRANS. TYP. NO. 13 TO TYP. NO. 4\",$D38,0))","v":0},{"$f":"IF($T38=\"TRANS. TYP. NO. 5 TO TYP. NO. 13\",$D38,IF($T38=\"TRANS. TYP. NO. 13 TO TYP. NO. 5\",$D38,0))","v":0},{"$f":"IF($T38=\"TRANS. TYP. NO. 6 TO TYP. NO. 13\",$D38,IF($T38=\"TRANS. TYP. NO. 13 TO TYP. NO. 6\",$D38,0))","v":0},{"$f":"IF($T38=\"TRANS. TYP. NO. 7 TO TYP. NO. 13\",$D38,IF($T38=\"TRANS. TYP. NO. 13 TO TYP. NO. 7\",$D38,0))","v":0},{"$f":"IF($T38=\"TRANS. TYP. NO. 8 TO TYP. NO. 13\",$D38,IF($T38=\"TRANS. TYP. NO. 13 TO TYP. NO. 8\",$D38,0))","v":0},{"$f":"IF($T38=\"TRANS. TYP. NO. 9 TO TYP. NO. 13\",$D38,IF($T38=\"TRANS. TYP. NO. 13 TO TYP. NO. 9\",$D38,0))","v":0},{"$f":"IF($T38=\"TRANS. TYP. NO. 10 TO TYP. NO. 13\",$D38,IF($T38=\"TRANS. TYP. NO. 13 TO TYP. NO. 10\",$D38,0))","v":0},{"$f":"IF($T38=\"TRANS. TYP. NO. 11 TO TYP. NO. 13\",$D38,IF($T38=\"TRANS. TYP. NO. 13 TO TYP. NO. 11\",$D38,0))","v":0},{"$f":"IF($T38=\"TRANS. TYP. NO. 12 TO TYP. NO. 13\",$D38,IF($T38=\"TRANS. TYP. NO. 13 TO TYP. NO. 12\",$D38,0))","v":0},{"$f":"IF(T38=\"TYP. NO. 14\",D38,0)","v":0},{"$f":"IF($T38=\"TRANS. TYP. NO. 1 TO TYP. NO. 14\",$D38,IF($T38=\"TRANS. TYP. NO. 14 TO TYP. NO. 1\",$D38,0))","v":0},{"$f":"IF($T38=\"TRANS. TYP. NO. 2 TO TYP. NO. 14\",$D38,IF($T38=\"TRANS. TYP. NO. 14 TO TYP. NO. 2\",$D38,0))","v":0},{"$f":"IF($T38=\"TRANS. TYP. NO. 3 TO TYP. NO. 14\",$D38,IF($T38=\"TRANS. TYP. NO. 14 TO TYP. NO. 3\",$D38,0))","v":0},{"$f":"IF($T38=\"TRANS. TYP. NO. 4 TO TYP. NO. 14\",$D38,IF($T38=\"TRANS. TYP. NO. 14 TO TYP. NO. 4\",$D38,0))","v":0},{"$f":"IF($T38=\"TRANS. TYP. NO. 5 TO TYP. NO. 14\",$D38,IF($T38=\"TRANS. TYP. NO. 14 TO TYP. NO. 5\",$D38,0))","v":0},{"$f":"IF($T38=\"TRANS. TYP. NO. 6 TO TYP. NO. 14\",$D38,IF($T38=\"TRANS. TYP. NO. 14 TO TYP. NO. 6\",$D38,0))","v":0},{"$f":"IF($T38=\"TRANS. TYP. NO. 7 TO TYP. NO. 14\",$D38,IF($T38=\"TRANS. TYP. NO. 14 TO TYP. NO. 7\",$D38,0))","v":0},{"$f":"IF($T38=\"TRANS. TYP. NO. 8 TO TYP. NO. 14\",$D38,IF($T38=\"TRANS. TYP. NO. 14 TO TYP. NO. 8\",$D38,0))","v":0},{"$f":"IF($T38=\"TRANS. TYP. NO. 9 TO TYP. NO. 14\",$D38,IF($T38=\"TRANS. TYP. NO. 14 TO TYP. NO. 9\",$D38,0))","v":0},{"$f":"IF($T38=\"TRANS. TYP. NO. 10 TO TYP. NO. 14\",$D38,IF($T38=\"TRANS. TYP. NO. 14 TO TYP. NO. 10\",$D38,0))","v":0},{"$f":"IF($T38=\"TRANS. TYP. NO. 11 TO TYP. NO. 14\",$D38,IF($T38=\"TRANS. TYP. NO. 14 TO TYP. NO. 11\",$D38,0))","v":0},{"$f":"IF($T38=\"TRANS. TYP. NO. 12 TO TYP. NO. 14\",$D38,IF($T38=\"TRANS. TYP. NO. 14 TO TYP. NO. 12\",$D38,0))","v":0},{"$f":"IF($T38=\"TRANS. TYP. NO. 13 TO TYP. NO. 14\",$D38,IF($T38=\"TRANS. TYP. NO. 14 TO TYP. NO. 13\",$D38,0))","v":0},{"$f":"IF(T38=\"TYP. NO. 15\",D38,0)","v":0},{"$f":"IF($T38=\"TRANS. TYP. NO. 1 TO TYP. NO. 15\",$D38,IF($T38=\"TRANS. TYP. NO. 15 TO TYP. NO. 1\",$D38,0))","v":0},{"$f":"IF($T38=\"TRANS. TYP. NO. 2 TO TYP. NO. 15\",$D38,IF($T38=\"TRANS. TYP. NO. 15 TO TYP. NO. 2\",$D38,0))","v":0},{"$f":"IF($T38=\"TRANS. TYP. NO. 3 TO TYP. NO. 15\",$D38,IF($T38=\"TRANS. TYP. NO. 15 TO TYP. NO. 3\",$D38,0))","v":0},{"$f":"IF($T38=\"TRANS. TYP. NO. 4 TO TYP. NO. 15\",$D38,IF($T38=\"TRANS. TYP. NO. 15 TO TYP. NO. 4\",$D38,0))","v":0},{"$f":"IF($T38=\"TRANS. TYP. NO. 5 TO TYP. NO. 15\",$D38,IF($T38=\"TRANS. TYP. NO. 15 TO TYP. NO. 5\",$D38,0))","v":0},{"$f":"IF($T38=\"TRANS. TYP. NO. 6 TO TYP. NO. 15\",$D38,IF($T38=\"TRANS. TYP. NO. 15 TO TYP. NO. 6\",$D38,0))","v":0},{"$f":"IF($T38=\"TRANS. TYP. NO. 7 TO TYP. NO. 15\",$D38,IF($T38=\"TRANS. TYP. NO. 15 TO TYP. NO. 7\",$D38,0))","v":0},{"$f":"IF($T38=\"TRANS. TYP. NO. 8 TO TYP. NO. 15\",$D38,IF($T38=\"TRANS. TYP. NO. 15 TO TYP. NO. 8\",$D38,0))","v":0},{"$f":"IF($T38=\"TRANS. TYP. NO. 9 TO TYP. NO. 15\",$D38,IF($T38=\"TRANS. TYP. NO. 15 TO TYP. NO. 9\",$D38,0))","v":0},{"$f":"IF($T38=\"TRANS. TYP. NO. 10 TO TYP. NO. 15\",$D38,IF($T38=\"TRANS. TYP. NO. 15 TO TYP. NO. 10\",$D38,0))","v":0},{"$f":"IF($T38=\"TRANS. TYP. NO. 11 TO TYP. NO. 15\",$D38,IF($T38=\"TRANS. TYP. NO. 15 TO TYP. NO. 11\",$D38,0))","v":0},{"$f":"IF($T38=\"TRANS. TYP. NO. 12 TO TYP. NO. 15\",$D38,IF($T38=\"TRANS. TYP. NO. 15 TO TYP. NO. 12\",$D38,0))","v":0},{"$f":"IF($T38=\"TRANS. TYP. NO. 13 TO TYP. NO. 15\",$D38,IF($T38=\"TRANS. TYP. NO. 15 TO TYP. NO. 13\",$D38,0))","v":0},{"$f":"IF($T38=\"TRANS. TYP. NO. 14 TO TYP. NO. 15\",$D38,IF($T38=\"TRANS. TYP. NO. 15 TO TYP. NO. 14\",$D38,0))","v":0},{"$f":"IF(T38=\"TYP. NO. 16\",D38,0)","v":0},{"$f":"IF($T38=\"TRANS. TYP. NO. 1 TO TYP. NO. 16\",$D38,IF($T38=\"TRANS. TYP. NO. 16 TO TYP. NO. 1\",$D38,0))","v":0},{"$f":"IF($T38=\"TRANS. TYP. NO. 2 TO TYP. NO. 16\",$D38,IF($T38=\"TRANS. TYP. NO. 16 TO TYP. NO. 2\",$D38,0))","v":0},{"$f":"IF($T38=\"TRANS. TYP. NO. 3 TO TYP. NO. 16\",$D38,IF($T38=\"TRANS. TYP. NO. 16 TO TYP. NO. 3\",$D38,0))","v":0},{"$f":"IF($T38=\"TRANS. TYP. NO. 4 TO TYP. NO. 16\",$D38,IF($T38=\"TRANS. TYP. NO. 16 TO TYP. NO. 4\",$D38,0))","v":0},{"$f":"IF($T38=\"TRANS. TYP. NO. 5 TO TYP. NO. 16\",$D38,IF($T38=\"TRANS. TYP. NO. 16 TO TYP. NO. 5\",$D38,0))","v":0},{"$f":"IF($T38=\"TRANS. TYP. NO. 6 TO TYP. NO. 16\",$D38,IF($T38=\"TRANS. TYP. NO. 16 TO TYP. NO. 6\",$D38,0))","v":0},{"$f":"IF($T38=\"TRANS. TYP. NO. 7 TO TYP. NO. 16\",$D38,IF($T38=\"TRANS. TYP. NO. 16 TO TYP. NO. 7\",$D38,0))","v":0},{"$f":"IF($T38=\"TRANS. TYP. NO. 8 TO TYP. NO. 16\",$D38,IF($T38=\"TRANS. TYP. NO. 16 TO TYP. NO. 8\",$D38,0))","v":0},{"$f":"IF($T38=\"TRANS. TYP. NO. 9 TO TYP. NO. 16\",$D38,IF($T38=\"TRANS. TYP. NO. 16 TO TYP. NO. 9\",$D38,0))","v":0},{"$f":"IF($T38=\"TRANS. TYP. NO. 10 TO TYP. NO. 16\",$D38,IF($T38=\"TRANS. TYP. NO. 16 TO TYP. NO. 10\",$D38,0))","v":0},{"$f":"IF($T38=\"TRANS. TYP. NO. 11 TO TYP. NO. 16\",$D38,IF($T38=\"TRANS. TYP. NO. 16 TO TYP. NO. 11\",$D38,0))","v":0},{"$f":"IF($T38=\"TRANS. TYP. NO. 12 TO TYP. NO. 16\",$D38,IF($T38=\"TRANS. TYP. NO. 16 TO TYP. NO. 12\",$D38,0))","v":0},{"$f":"IF($T38=\"TRANS. TYP. NO. 13 TO TYP. NO. 16\",$D38,IF($T38=\"TRANS. TYP. NO. 16 TO TYP. NO. 13\",$D38,0))","v":0},{"$f":"IF($T38=\"TRANS. TYP. NO. 14 TO TYP. NO. 16\",$D38,IF($T38=\"TRANS. TYP. NO. 16 TO TYP. NO. 14\",$D38,0))","v":0},{"$f":"IF($T38=\"TRANS. TYP. NO. 15 TO TYP. NO. 16\",$D38,IF($T38=\"TRANS. TYP. NO. 16 TO TYP. NO. 15\",$D38,0))","v":0}]
[null,null,"","",null,null,null,null,"","","","","","","","","","","",null,null,{"$f":"IF(T39=\"\",402,MATCH(T39,'Lookup Values'!$B$1:$B$402,0))","v":402},{"$f":"LOOKUP($V39,'Lookup Values'!$A$2:$A$402,'Lookup Values'!C$2:C$402)","v":"ERROR"},{"$f":"LOOKUP($V39,'Lookup Values'!$A$2:$A$402,'Lookup Values'!D$2:D$402)","v":"ERROR"},{"$f":"LOOKUP($V39,'Lookup Values'!$A$2:$A$402,'Lookup Values'!E$2:E$402)","v":"ERROR"},{"$f":"LOOKUP($V39,'Lookup Values'!$A$2:$A$402,'Lookup Values'!F$2:F$402)","v":"ERROR"},{"$f":"LOOKUP($V39,'Lookup Values'!$A$2:$A$402,'Lookup Values'!G$2:G$402)","v":"ERROR"},{"$f":"LOOKUP($V39,'Lookup Values'!$A$2:$A$402,'Lookup Values'!H$2:H$402)","v":"ERROR"},{"$f":"LOOKUP($V39,'Lookup Values'!$A$2:$A$402,'Lookup Values'!I$2:I$402)","v":"ERROR"},{"$f":"LOOKUP($V39,'Lookup Values'!$A$2:$A$402,'Lookup Values'!J$2:J$402)","v":"ERROR"},{"$f":"LOOKUP($V39,'Lookup Values'!$A$2:$A$402,'Lookup Values'!K$2:K$402)","v":"ERROR"},{"$f":"LOOKUP($V39,'Lookup Values'!$A$2:$A$402,'Lookup Values'!L$2:L$402)","v":"ERROR"},{"$f":"LOOKUP($V39,'Lookup Values'!$A$2:$A$402,'Lookup Values'!M$2:M$402)","v":"ERROR"},null,0,0,0,0,0,0,0,0,0,0,0,0,0,0,0,0,0,0,0,0,0,0,0,0,0,0,0,0,0,0,0,0,0,0,0,0,0,0,0,0,0,0,0,0,0,0,0,0,0,0,0,0,0,0,0,0,0,0,0,0,0,0,0,0,0,0,0,0,0,0,0,0,0,0,0,0,0,0,0,0,0,0,0,0,0,0,0,0,0,0,0,0,0,0,0,0,0,0,0,0,0,0,0,0,0,0,0,0,0,0,0,0,0,0,0,0,0,0,0,0,0,0,0,0,0,0,0,0,0,0,0,0,0,0,0,0]
[null,null,"","",null,null,null,null,"","","","","","","","","","","",null,null,{"$f":"IF(T40=\"\",402,MATCH(T40,'Lookup Values'!$B$1:$B$402,0))","v":402},{"$f":"LOOKUP($V40,'Lookup Values'!$A$2:$A$402,'Lookup Values'!C$2:C$402)","v":"ERROR"},{"$f":"LOOKUP($V40,'Lookup Values'!$A$2:$A$402,'Lookup Values'!D$2:D$402)","v":"ERROR"},{"$f":"LOOKUP($V40,'Lookup Values'!$A$2:$A$402,'Lookup Values'!E$2:E$402)","v":"ERROR"},{"$f":"LOOKUP($V40,'Lookup Values'!$A$2:$A$402,'Lookup Values'!F$2:F$402)","v":"ERROR"},{"$f":"LOOKUP($V40,'Lookup Values'!$A$2:$A$402,'Lookup Values'!G$2:G$402)","v":"ERROR"},{"$f":"LOOKUP($V40,'Lookup Values'!$A$2:$A$402,'Lookup Values'!H$2:H$402)","v":"ERROR"},{"$f":"LOOKUP($V40,'Lookup Values'!$A$2:$A$402,'Lookup Values'!I$2:I$402)","v":"ERROR"},{"$f":"LOOKUP($V40,'Lookup Values'!$A$2:$A$402,'Lookup Values'!J$2:J$402)","v":"ERROR"},{"$f":"LOOKUP($V40,'Lookup Values'!$A$2:$A$402,'Lookup Values'!K$2:K$402)","v":"ERROR"},{"$f":"LOOKUP($V40,'Lookup Values'!$A$2:$A$402,'Lookup Values'!L$2:L$402)","v":"ERROR"},{"$f":"LOOKUP($V40,'Lookup Values'!$A$2:$A$402,'Lookup Values'!M$2:M$402)","v":"ERROR"},null,0,0,0,0,0,0,0,0,0,0,0,0,0,0,0,0,0,0,0,0,0,0,0,0,0,0,0,0,0,0,0,0,0,0,0,0,0,0,0,0,0,0,0,0,0,0,0,0,0,0,0,0,0,0,0,0,0,0,0,0,0,0,0,0,0,0,0,0,0,0,0,0,0,0,0,0,0,0,0,0,0,0,0,0,0,0,0,0,0,0,0,0,0,0,0,0,0,0,0,0,0,0,0,0,0,0,0,0,0,0,0,0,0,0,0,0,0,0,0,0,0,0,0,0,0,0,0,0,0,0,0,0,0,0,0,0]
[null,null,"","",null,null,null,null,"","","","","","","","","","","",null,null,{"$f":"IF(T41=\"\",402,MATCH(T41,'Lookup Values'!$B$1:$B$402,0))","v":402},{"$f":"LOOKUP($V41,'Lookup Values'!$A$2:$A$402,'Lookup Values'!C$2:C$402)","v":"ERROR"},{"$f":"LOOKUP($V41,'Lookup Values'!$A$2:$A$402,'Lookup Values'!D$2:D$402)","v":"ERROR"},{"$f":"LOOKUP($V41,'Lookup Values'!$A$2:$A$402,'Lookup Values'!E$2:E$402)","v":"ERROR"},{"$f":"LOOKUP($V41,'Lookup Values'!$A$2:$A$402,'Lookup Values'!F$2:F$402)","v":"ERROR"},{"$f":"LOOKUP($V41,'Lookup Values'!$A$2:$A$402,'Lookup Values'!G$2:G$402)","v":"ERROR"},{"$f":"LOOKUP($V41,'Lookup Values'!$A$2:$A$402,'Lookup Values'!H$2:H$402)","v":"ERROR"},{"$f":"LOOKUP($V41,'Lookup Values'!$A$2:$A$402,'Lookup Values'!I$2:I$402)","v":"ERROR"},{"$f":"LOOKUP($V41,'Lookup Values'!$A$2:$A$402,'Lookup Values'!J$2:J$402)","v":"ERROR"},{"$f":"LOOKUP($V41,'Lookup Values'!$A$2:$A$402,'Lookup Values'!K$2:K$402)","v":"ERROR"},{"$f":"LOOKUP($V41,'Lookup Values'!$A$2:$A$402,'Lookup Values'!L$2:L$402)","v":"ERROR"},{"$f":"LOOKUP($V41,'Lookup Values'!$A$2:$A$402,'Lookup Values'!M$2:M$402)","v":"ERROR"},null,0,0,0,0,0,0,0,0,0,0,0,0,0,0,0,0,0,0,0,0,0,0,0,0,0,0,0,0,0,0,0,0,0,0,0,0,0,0,0,0,0,0,0,0,0,0,0,0,0,0,0,0,0,0,0,0,0,0,0,0,0,0,0,0,0,0,0,0,0,0,0,0,0,0,0,0,0,0,0,0,0,0,0,0,0,0,0,0,0,0,0,0,0,0,0,0,0,0,0,0,0,0,0,0,0,0,0,0,0,0,0,0,0,0,0,0,0,0,0,0,0,0,0,0,0,0,0,0,0,0,0,0,0,0,0,0]
[null,null,"","",null,null,null,null,"","","","","","","","","","","",null,null,{"$f":"IF(T42=\"\",402,MATCH(T42,'Lookup Values'!$B$1:$B$402,0))","v":402},{"$f":"LOOKUP($V42,'Lookup Values'!$A$2:$A$402,'Lookup Values'!C$2:C$402)","v":"ERROR"},{"$f":"LOOKUP($V42,'Lookup Values'!$A$2:$A$402,'Lookup Values'!D$2:D$402)","v":"ERROR"},{"$f":"LOOKUP($V42,'Lookup Values'!$A$2:$A$402,'Lookup Values'!E$2:E$402)","v":"ERROR"},{"$f":"LOOKUP($V42,'Lookup Values'!$A$2:$A$402,'Lookup Values'!F$2:F$402)","v":"ERROR"},{"$f":"LOOKUP($V42,'Lookup Values'!$A$2:$A$402,'Lookup Values'!G$2:G$402)","v":"ERROR"},{"$f":"LOOKUP($V42,'Lookup Values'!$A$2:$A$402,'Lookup Values'!H$2:H$402)","v":"ERROR"},{"$f":"LOOKUP($V42,'Lookup Values'!$A$2:$A$402,'Lookup Values'!I$2:I$402)","v":"ERROR"},{"$f":"LOOKUP($V42,'Lookup Values'!$A$2:$A$402,'Lookup Values'!J$2:J$402)","v":"ERROR"},{"$f":"LOOKUP($V42,'Lookup Values'!$A$2:$A$402,'Lookup Values'!K$2:K$402)","v":"ERROR"},{"$f":"LOOKUP($V42,'Lookup Values'!$A$2:$A$402,'Lookup Values'!L$2:L$402)","v":"ERROR"},{"$f":"LOOKUP($V42,'Lookup Values'!$A$2:$A$402,'Lookup Values'!M$2:M$402)","v":"ERROR"},null,0,0,0,0,0,0,0,0,0,0,0,0,0,0,0,0,0,0,0,0,0,0,0,0,0,0,0,0,0,0,0,0,0,0,0,0,0,0,0,0,0,0,0,0,0,0,0,0,0,0,0,0,0,0,0,0,0,0,0,0,0,0,0,0,0,0,0,0,0,0,0,0,0,0,0,0,0,0,0,0,0,0,0,0,0,0,0,0,0,0,0,0,0,0,0,0,0,0,0,0,0,0,0,0,0,0,0,0,0,0,0,0,0,0,0,0,0,0,0,0,0,0,0,0,0,0,0,0,0,0,0,0,0,0,0,0]
[null,null,"","",null,null,null,null,"","","","","","","","","","","",null,null,{"$f":"IF(T43=\"\",402,MATCH(T43,'Lookup Values'!$B$1:$B$402,0))","v":402},{"$f":"LOOKUP($V43,'Lookup Values'!$A$2:$A$402,'Lookup Values'!C$2:C$402)","v":"ERROR"},{"$f":"LOOKUP($V43,'Lookup Values'!$A$2:$A$402,'Lookup Values'!D$2:D$402)","v":"ERROR"},{"$f":"LOOKUP($V43,'Lookup Values'!$A$2:$A$402,'Lookup Values'!E$2:E$402)","v":"ERROR"},{"$f":"LOOKUP($V43,'Lookup Values'!$A$2:$A$402,'Lookup Values'!F$2:F$402)","v":"ERROR"},{"$f":"LOOKUP($V43,'Lookup Values'!$A$2:$A$402,'Lookup Values'!G$2:G$402)","v":"ERROR"},{"$f":"LOOKUP($V43,'Lookup Values'!$A$2:$A$402,'Lookup Values'!H$2:H$402)","v":"ERROR"},{"$f":"LOOKUP($V43,'Lookup Values'!$A$2:$A$402,'Lookup Values'!I$2:I$402)","v":"ERROR"},{"$f":"LOOKUP($V43,'Lookup Values'!$A$2:$A$402,'Lookup Values'!J$2:J$402)","v":"ERROR"},{"$f":"LOOKUP($V43,'Lookup Values'!$A$2:$A$402,'Lookup Values'!K$2:K$402)","v":"ERROR"},{"$f":"LOOKUP($V43,'Lookup Values'!$A$2:$A$402,'Lookup Values'!L$2:L$402)","v":"ERROR"},{"$f":"LOOKUP($V43,'Lookup Values'!$A$2:$A$402,'Lookup Values'!M$2:M$402)","v":"ERROR"},null,0,0,0,0,0,0,0,0,0,0,0,0,0,0,0,0,0,0,0,0,0,0,0,0,0,0,0,0,0,0,0,0,0,0,0,0,0,0,0,0,0,0,0,0,0,0,0,0,0,0,0,0,0,0,0,0,0,0,0,0,0,0,0,0,0,0,0,0,0,0,0,0,0,0,0,0,0,0,0,0,0,0,0,0,0,0,0,0,0,0,0,0,0,0,0,0,0,0,0,0,0,0,0,0,0,0,0,0,0,0,0,0,0,0,0,0,0,0,0,0,0,0,0,0,0,0,0,0,0,0,0,0,0,0,0,0]
[null,null,"","",null,null,null,null,"","","","","","","","","","","",null,null,{"$f":"IF(T44=\"\",402,MATCH(T44,'Lookup Values'!$B$1:$B$402,0))","v":402},{"$f":"LOOKUP($V44,'Lookup Values'!$A$2:$A$402,'Lookup Values'!C$2:C$402)","v":"ERROR"},{"$f":"LOOKUP($V44,'Lookup Values'!$A$2:$A$402,'Lookup Values'!D$2:D$402)","v":"ERROR"},{"$f":"LOOKUP($V44,'Lookup Values'!$A$2:$A$402,'Lookup Values'!E$2:E$402)","v":"ERROR"},{"$f":"LOOKUP($V44,'Lookup Values'!$A$2:$A$402,'Lookup Values'!F$2:F$402)","v":"ERROR"},{"$f":"LOOKUP($V44,'Lookup Values'!$A$2:$A$402,'Lookup Values'!G$2:G$402)","v":"ERROR"},{"$f":"LOOKUP($V44,'Lookup Values'!$A$2:$A$402,'Lookup Values'!H$2:H$402)","v":"ERROR"},{"$f":"LOOKUP($V44,'Lookup Values'!$A$2:$A$402,'Lookup Values'!I$2:I$402)","v":"ERROR"},{"$f":"LOOKUP($V44,'Lookup Values'!$A$2:$A$402,'Lookup Values'!J$2:J$402)","v":"ERROR"},{"$f":"LOOKUP($V44,'Lookup Values'!$A$2:$A$402,'Lookup Values'!K$2:K$402)","v":"ERROR"},{"$f":"LOOKUP($V44,'Lookup Values'!$A$2:$A$402,'Lookup Values'!L$2:L$402)","v":"ERROR"},{"$f":"LOOKUP($V44,'Lookup Values'!$A$2:$A$402,'Lookup Values'!M$2:M$402)","v":"ERROR"},null,0,0,0,0,0,0,0,0,0,0,0,0,0,0,0,0,0,0,0,0,0,0,0,0,0,0,0,0,0,0,0,0,0,0,0,0,0,0,0,0,0,0,0,0,0,0,0,0,0,0,0,0,0,0,0,0,0,0,0,0,0,0,0,0,0,0,0,0,0,0,0,0,0,0,0,0,0,0,0,0,0,0,0,0,0,0,0,0,0,0,0,0,0,0,0,0,0,0,0,0,0,0,0,0,0,0,0,0,0,0,0,0,0,0,0,0,0,0,0,0,0,0,0,0,0,0,0,0,0,0,0,0,0,0,0,0]
[null,null,"","",null,null,null,null,"","","","","","","","","","","",null,null,{"$f":"IF(T45=\"\",402,MATCH(T45,'Lookup Values'!$B$1:$B$402,0))","v":402},{"$f":"LOOKUP($V45,'Lookup Values'!$A$2:$A$402,'Lookup Values'!C$2:C$402)","v":"ERROR"},{"$f":"LOOKUP($V45,'Lookup Values'!$A$2:$A$402,'Lookup Values'!D$2:D$402)","v":"ERROR"},{"$f":"LOOKUP($V45,'Lookup Values'!$A$2:$A$402,'Lookup Values'!E$2:E$402)","v":"ERROR"},{"$f":"LOOKUP($V45,'Lookup Values'!$A$2:$A$402,'Lookup Values'!F$2:F$402)","v":"ERROR"},{"$f":"LOOKUP($V45,'Lookup Values'!$A$2:$A$402,'Lookup Values'!G$2:G$402)","v":"ERROR"},{"$f":"LOOKUP($V45,'Lookup Values'!$A$2:$A$402,'Lookup Values'!H$2:H$402)","v":"ERROR"},{"$f":"LOOKUP($V45,'Lookup Values'!$A$2:$A$402,'Lookup Values'!I$2:I$402)","v":"ERROR"},{"$f":"LOOKUP($V45,'Lookup Values'!$A$2:$A$402,'Lookup Values'!J$2:J$402)","v":"ERROR"},{"$f":"LOOKUP($V45,'Lookup Values'!$A$2:$A$402,'Lookup Values'!K$2:K$402)","v":"ERROR"},{"$f":"LOOKUP($V45,'Lookup Values'!$A$2:$A$402,'Lookup Values'!L$2:L$402)","v":"ERROR"},{"$f":"LOOKUP($V45,'Lookup Values'!$A$2:$A$402,'Lookup Values'!M$2:M$402)","v":"ERROR"},null,0,0,0,0,0,0,0,0,0,0,0,0,0,0,0,0,0,0,0,0,0,0,0,0,0,0,0,0,0,0,0,0,0,0,0,0,0,0,0,0,0,0,0,0,0,0,0,0,0,0,0,0,0,0,0,0,0,0,0,0,0,0,0,0,0,0,0,0,0,0,0,0,0,0,0,0,0,0,0,0,0,0,0,0,0,0,0,0,0,0,0,0,0,0,0,0,0,0,0,0,0,0,0,0,0,0,0,0,0,0,0,0,0,0,0,0,0,0,0,0,0,0,0,0,0,0,0,0,0,0,0,0,0,0,0,0]
[null,null,"","",null,null,null,null,"","","","","","","","","","","",null,null,{"$f":"IF(T46=\"\",402,MATCH(T46,'Lookup Values'!$B$1:$B$402,0))","v":402},{"$f":"LOOKUP($V46,'Lookup Values'!$A$2:$A$402,'Lookup Values'!C$2:C$402)","v":"ERROR"},{"$f":"LOOKUP($V46,'Lookup Values'!$A$2:$A$402,'Lookup Values'!D$2:D$402)","v":"ERROR"},{"$f":"LOOKUP($V46,'Lookup Values'!$A$2:$A$402,'Lookup Values'!E$2:E$402)","v":"ERROR"},{"$f":"LOOKUP($V46,'Lookup Values'!$A$2:$A$402,'Lookup Values'!F$2:F$402)","v":"ERROR"},{"$f":"LOOKUP($V46,'Lookup Values'!$A$2:$A$402,'Lookup Values'!G$2:G$402)","v":"ERROR"},{"$f":"LOOKUP($V46,'Lookup Values'!$A$2:$A$402,'Lookup Values'!H$2:H$402)","v":"ERROR"},{"$f":"LOOKUP($V46,'Lookup Values'!$A$2:$A$402,'Lookup Values'!I$2:I$402)","v":"ERROR"},{"$f":"LOOKUP($V46,'Lookup Values'!$A$2:$A$402,'Lookup Values'!J$2:J$402)","v":"ERROR"},{"$f":"LOOKUP($V46,'Lookup Values'!$A$2:$A$402,'Lookup Values'!K$2:K$402)","v":"ERROR"},{"$f":"LOOKUP($V46,'Lookup Values'!$A$2:$A$402,'Lookup Values'!L$2:L$402)","v":"ERROR"},{"$f":"LOOKUP($V46,'Lookup Values'!$A$2:$A$402,'Lookup Values'!M$2:M$402)","v":"ERROR"},null,0,0,0,0,0,0,0,0,0,0,0,0,0,0,0,0,0,0,0,0,0,0,0,0,0,0,0,0,0,0,0,0,0,0,0,0,0,0,0,0,0,0,0,0,0,0,0,0,0,0,0,0,0,0,0,0,0,0,0,0,0,0,0,0,0,0,0,0,0,0,0,0,0,0,0,0,0,0,0,0,0,0,0,0,0,0,0,0,0,0,0,0,0,0,0,0,0,0,0,0,0,0,0,0,0,0,0,0,0,0,0,0,0,0,0,0,0,0,0,0,0,0,0,0,0,0,0,0,0,0,0,0,0,0,0,0]
[null,null,"","",null,null,null,null,"","","","","","","","","","","",null,null,{"$f":"IF(T47=\"\",402,MATCH(T47,'Lookup Values'!$B$1:$B$402,0))","v":402},{"$f":"LOOKUP($V47,'Lookup Values'!$A$2:$A$402,'Lookup Values'!C$2:C$402)","v":"ERROR"},{"$f":"LOOKUP($V47,'Lookup Values'!$A$2:$A$402,'Lookup Values'!D$2:D$402)","v":"ERROR"},{"$f":"LOOKUP($V47,'Lookup Values'!$A$2:$A$402,'Lookup Values'!E$2:E$402)","v":"ERROR"},{"$f":"LOOKUP($V47,'Lookup Values'!$A$2:$A$402,'Lookup Values'!F$2:F$402)","v":"ERROR"},{"$f":"LOOKUP($V47,'Lookup Values'!$A$2:$A$402,'Lookup Values'!G$2:G$402)","v":"ERROR"},{"$f":"LOOKUP($V47,'Lookup Values'!$A$2:$A$402,'Lookup Values'!H$2:H$402)","v":"ERROR"},{"$f":"LOOKUP($V47,'Lookup Values'!$A$2:$A$402,'Lookup Values'!I$2:I$402)","v":"ERROR"},{"$f":"LOOKUP($V47,'Lookup Values'!$A$2:$A$402,'Lookup Values'!J$2:J$402)","v":"ERROR"},{"$f":"LOOKUP($V47,'Lookup Values'!$A$2:$A$402,'Lookup Values'!K$2:K$402)","v":"ERROR"},{"$f":"LOOKUP($V47,'Lookup Values'!$A$2:$A$402,'Lookup Values'!L$2:L$402)","v":"ERROR"},{"$f":"LOOKUP($V47,'Lookup Values'!$A$2:$A$402,'Lookup Values'!M$2:M$402)","v":"ERROR"},null,0,0,0,0,0,0,0,0,0,0,0,0,0,0,0,0,0,0,0,0,0,0,0,0,0,0,0,0,0,0,0,0,0,0,0,0,0,0,0,0,0,0,0,0,0,0,0,0,0,0,0,0,0,0,0,0,0,0,0,0,0,0,0,0,0,0,0,0,0,0,0,0,0,0,0,0,0,0,0,0,0,0,0,0,0,0,0,0,0,0,0,0,0,0,0,0,0,0,0,0,0,0,0,0,0,0,0,0,0,0,0,0,0,0,0,0,0,0,0,0,0,0,0,0,0,0,0,0,0,0,0,0,0,0,0,0]
[null,null,"","",null,null,null,null,"","","","","","","","","","","",null,null,{"$f":"IF(T48=\"\",402,MATCH(T48,'Lookup Values'!$B$1:$B$402,0))","v":402},{"$f":"LOOKUP($V48,'Lookup Values'!$A$2:$A$402,'Lookup Values'!C$2:C$402)","v":"ERROR"},{"$f":"LOOKUP($V48,'Lookup Values'!$A$2:$A$402,'Lookup Values'!D$2:D$402)","v":"ERROR"},{"$f":"LOOKUP($V48,'Lookup Values'!$A$2:$A$402,'Lookup Values'!E$2:E$402)","v":"ERROR"},{"$f":"LOOKUP($V48,'Lookup Values'!$A$2:$A$402,'Lookup Values'!F$2:F$402)","v":"ERROR"},{"$f":"LOOKUP($V48,'Lookup Values'!$A$2:$A$402,'Lookup Values'!G$2:G$402)","v":"ERROR"},{"$f":"LOOKUP($V48,'Lookup Values'!$A$2:$A$402,'Lookup Values'!H$2:H$402)","v":"ERROR"},{"$f":"LOOKUP($V48,'Lookup Values'!$A$2:$A$402,'Lookup Values'!I$2:I$402)","v":"ERROR"},{"$f":"LOOKUP($V48,'Lookup Values'!$A$2:$A$402,'Lookup Values'!J$2:J$402)","v":"ERROR"},{"$f":"LOOKUP($V48,'Lookup Values'!$A$2:$A$402,'Lookup Values'!K$2:K$402)","v":"ERROR"},{"$f":"LOOKUP($V48,'Lookup Values'!$A$2:$A$402,'Lookup Values'!L$2:L$402)","v":"ERROR"},{"$f":"LOOKUP($V48,'Lookup Values'!$A$2:$A$402,'Lookup Values'!M$2:M$402)","v":"ERROR"},null,0,0,0,0,0,0,0,0,0,0,0,0,0,0,0,0,0,0,0,0,0,0,0,0,0,0,0,0,0,0,0,0,0,0,0,0,0,0,0,0,0,0,0,0,0,0,0,0,0,0,0,0,0,0,0,0,0,0,0,0,0,0,0,0,0,0,0,0,0,0,0,0,0,0,0,0,0,0,0,0,0,0,0,0,0,0,0,0,0,0,0,0,0,0,0,0,0,0,0,0,0,0,0,0,0,0,0,0,0,0,0,0,0,0,0,0,0,0,0,0,0,0,0,0,0,0,0,0,0,0,0,0,0,0,0,0]
[null,null,"","",null,null,null,null,"","","","","","","","","","","",null,null,{"$f":"IF(T49=\"\",402,MATCH(T49,'Lookup Values'!$B$1:$B$402,0))","v":402},{"$f":"LOOKUP($V49,'Lookup Values'!$A$2:$A$402,'Lookup Values'!C$2:C$402)","v":"ERROR"},{"$f":"LOOKUP($V49,'Lookup Values'!$A$2:$A$402,'Lookup Values'!D$2:D$402)","v":"ERROR"},{"$f":"LOOKUP($V49,'Lookup Values'!$A$2:$A$402,'Lookup Values'!E$2:E$402)","v":"ERROR"},{"$f":"LOOKUP($V49,'Lookup Values'!$A$2:$A$402,'Lookup Values'!F$2:F$402)","v":"ERROR"},{"$f":"LOOKUP($V49,'Lookup Values'!$A$2:$A$402,'Lookup Values'!G$2:G$402)","v":"ERROR"},{"$f":"LOOKUP($V49,'Lookup Values'!$A$2:$A$402,'Lookup Values'!H$2:H$402)","v":"ERROR"},{"$f":"LOOKUP($V49,'Lookup Values'!$A$2:$A$402,'Lookup Values'!I$2:I$402)","v":"ERROR"},{"$f":"LOOKUP($V49,'Lookup Values'!$A$2:$A$402,'Lookup Values'!J$2:J$402)","v":"ERROR"},{"$f":"LOOKUP($V49,'Lookup Values'!$A$2:$A$402,'Lookup Values'!K$2:K$402)","v":"ERROR"},{"$f":"LOOKUP($V49,'Lookup Values'!$A$2:$A$402,'Lookup Values'!L$2:L$402)","v":"ERROR"},{"$f":"LOOKUP($V49,'Lookup Values'!$A$2:$A$402,'Lookup Values'!M$2:M$402)","v":"ERROR"},null,0,0,0,0,0,0,0,0,0,0,0,0,0,0,0,0,0,0,0,0,0,0,0,0,0,0,0,0,0,0,0,0,0,0,0,0,0,0,0,0,0,0,0,0,0,0,0,0,0,0,0,0,0,0,0,0,0,0,0,0,0,0,0,0,0,0,0,0,0,0,0,0,0,0,0,0,0,0,0,0,0,0,0,0,0,0,0,0,0,0,0,0,0,0,0,0,0,0,0,0,0,0,0,0,0,0,0,0,0,0,0,0,0,0,0,0,0,0,0,0,0,0,0,0,0,0,0,0,0,0,0,0,0,0,0,0]
[null,null,"","",null,null,null,null,"","","","","","","","","","","",null,null,{"$f":"IF(T50=\"\",402,MATCH(T50,'Lookup Values'!$B$1:$B$402,0))","v":402},{"$f":"LOOKUP($V50,'Lookup Values'!$A$2:$A$402,'Lookup Values'!C$2:C$402)","v":"ERROR"},{"$f":"LOOKUP($V50,'Lookup Values'!$A$2:$A$402,'Lookup Values'!D$2:D$402)","v":"ERROR"},{"$f":"LOOKUP($V50,'Lookup Values'!$A$2:$A$402,'Lookup Values'!E$2:E$402)","v":"ERROR"},{"$f":"LOOKUP($V50,'Lookup Values'!$A$2:$A$402,'Lookup Values'!F$2:F$402)","v":"ERROR"},{"$f":"LOOKUP($V50,'Lookup Values'!$A$2:$A$402,'Lookup Values'!G$2:G$402)","v":"ERROR"},{"$f":"LOOKUP($V50,'Lookup Values'!$A$2:$A$402,'Lookup Values'!H$2:H$402)","v":"ERROR"},{"$f":"LOOKUP($V50,'Lookup Values'!$A$2:$A$402,'Lookup Values'!I$2:I$402)","v":"ERROR"},{"$f":"LOOKUP($V50,'Lookup Values'!$A$2:$A$402,'Lookup Values'!J$2:J$402)","v":"ERROR"},{"$f":"LOOKUP($V50,'Lookup Values'!$A$2:$A$402,'Lookup Values'!K$2:K$402)","v":"ERROR"},{"$f":"LOOKUP($V50,'Lookup Values'!$A$2:$A$402,'Lookup Values'!L$2:L$402)","v":"ERROR"},{"$f":"LOOKUP($V50,'Lookup Values'!$A$2:$A$402,'Lookup Values'!M$2:M$402)","v":"ERROR"},null,0,0,0,0,0,0,0,0,0,0,0,0,0,0,0,0,0,0,0,0,0,0,0,0,0,0,0,0,0,0,0,0,0,0,0,0,0,0,0,0,0,0,0,0,0,0,0,0,0,0,0,0,0,0,0,0,0,0,0,0,0,0,0,0,0,0,0,0,0,0,0,0,0,0,0,0,0,0,0,0,0,0,0,0,0,0,0,0,0,0,0,0,0,0,0,0,0,0,0,0,0,0,0,0,0,0,0,0,0,0,0,0,0,0,0,0,0,0,0,0,0,0,0,0,0,0,0,0,0,0,0,0,0,0,0,0]
[null,null,"","",null,null,null,null,"","","","","","","","","","","",null,null,{"$f":"IF(T51=\"\",402,MATCH(T51,'Lookup Values'!$B$1:$B$402,0))","v":402},{"$f":"LOOKUP($V51,'Lookup Values'!$A$2:$A$402,'Lookup Values'!C$2:C$402)","v":"ERROR"},{"$f":"LOOKUP($V51,'Lookup Values'!$A$2:$A$402,'Lookup Values'!D$2:D$402)","v":"ERROR"},{"$f":"LOOKUP($V51,'Lookup Values'!$A$2:$A$402,'Lookup Values'!E$2:E$402)","v":"ERROR"},{"$f":"LOOKUP($V51,'Lookup Values'!$A$2:$A$402,'Lookup Values'!F$2:F$402)","v":"ERROR"},{"$f":"LOOKUP($V51,'Lookup Values'!$A$2:$A$402,'Lookup Values'!G$2:G$402)","v":"ERROR"},{"$f":"LOOKUP($V51,'Lookup Values'!$A$2:$A$402,'Lookup Values'!H$2:H$402)","v":"ERROR"},{"$f":"LOOKUP($V51,'Lookup Values'!$A$2:$A$402,'Lookup Values'!I$2:I$402)","v":"ERROR"},{"$f":"LOOKUP($V51,'Lookup Values'!$A$2:$A$402,'Lookup Values'!J$2:J$402)","v":"ERROR"},{"$f":"LOOKUP($V51,'Lookup Values'!$A$2:$A$402,'Lookup Values'!K$2:K$402)","v":"ERROR"},{"$f":"LOOKUP($V51,'Lookup Values'!$A$2:$A$402,'Lookup Values'!L$2:L$402)","v":"ERROR"},{"$f":"LOOKUP($V51,'Lookup Values'!$A$2:$A$402,'Lookup Values'!M$2:M$402)","v":"ERROR"},null,0,0,0,0,0,0,0,0,0,0,0,0,0,0,0,0,0,0,0,0,0,0,0,0,0,0,0,0,0,0,0,0,0,0,0,0,0,0,0,0,0,0,0,0,0,0,0,0,0,0,0,0,0,0,0,0,0,0,0,0,0,0,0,0,0,0,0,0,0,0,0,0,0,0,0,0,0,0,0,0,0,0,0,0,0,0,0,0,0,0,0,0,0,0,0,0,0,0,0,0,0,0,0,0,0,0,0,0,0,0,0,0,0,0,0,0,0,0,0,0,0,0,0,0,0,0,0,0,0,0,0,0,0,0,0,0]
[null,null,"","",null,null,null,null,"","","","","","","","","","","",null,null,{"$f":"IF(T52=\"\",402,MATCH(T52,'Lookup Values'!$B$1:$B$402,0))","v":402},{"$f":"LOOKUP($V52,'Lookup Values'!$A$2:$A$402,'Lookup Values'!C$2:C$402)","v":"ERROR"},{"$f":"LOOKUP($V52,'Lookup Values'!$A$2:$A$402,'Lookup Values'!D$2:D$402)","v":"ERROR"},{"$f":"LOOKUP($V52,'Lookup Values'!$A$2:$A$402,'Lookup Values'!E$2:E$402)","v":"ERROR"},{"$f":"LOOKUP($V52,'Lookup Values'!$A$2:$A$402,'Lookup Values'!F$2:F$402)","v":"ERROR"},{"$f":"LOOKUP($V52,'Lookup Values'!$A$2:$A$402,'Lookup Values'!G$2:G$402)","v":"ERROR"},{"$f":"LOOKUP($V52,'Lookup Values'!$A$2:$A$402,'Lookup Values'!H$2:H$402)","v":"ERROR"},{"$f":"LOOKUP($V52,'Lookup Values'!$A$2:$A$402,'Lookup Values'!I$2:I$402)","v":"ERROR"},{"$f":"LOOKUP($V52,'Lookup Values'!$A$2:$A$402,'Lookup Values'!J$2:J$402)","v":"ERROR"},{"$f":"LOOKUP($V52,'Lookup Values'!$A$2:$A$402,'Lookup Values'!K$2:K$402)","v":"ERROR"},{"$f":"LOOKUP($V52,'Lookup Values'!$A$2:$A$402,'Lookup Values'!L$2:L$402)","v":"ERROR"},{"$f":"LOOKUP($V52,'Lookup Values'!$A$2:$A$402,'Lookup Values'!M$2:M$402)","v":"ERROR"},null,0,0,0,0,0,0,0,0,0,0,0,0,0,0,0,0,0,0,0,0,0,0,0,0,0,0,0,0,0,0,0,0,0,0,0,0,0,0,0,0,0,0,0,0,0,0,0,0,0,0,0,0,0,0,0,0,0,0,0,0,0,0,0,0,0,0,0,0,0,0,0,0,0,0,0,0,0,0,0,0,0,0,0,0,0,0,0,0,0,0,0,0,0,0,0,0,0,0,0,0,0,0,0,0,0,0,0,0,0,0,0,0,0,0,0,0,0,0,0,0,0,0,0,0,0,0,0,0,0,0,0,0,0,0,0,0]
[null,null,"","",null,null,null,null,"","","","","","","","","","","",null,null,{"$f":"IF(T53=\"\",402,MATCH(T53,'Lookup Values'!$B$1:$B$402,0))","v":402},{"$f":"LOOKUP($V53,'Lookup Values'!$A$2:$A$402,'Lookup Values'!C$2:C$402)","v":"ERROR"},{"$f":"LOOKUP($V53,'Lookup Values'!$A$2:$A$402,'Lookup Values'!D$2:D$402)","v":"ERROR"},{"$f":"LOOKUP($V53,'Lookup Values'!$A$2:$A$402,'Lookup Values'!E$2:E$402)","v":"ERROR"},{"$f":"LOOKUP($V53,'Lookup Values'!$A$2:$A$402,'Lookup Values'!F$2:F$402)","v":"ERROR"},{"$f":"LOOKUP($V53,'Lookup Values'!$A$2:$A$402,'Lookup Values'!G$2:G$402)","v":"ERROR"},{"$f":"LOOKUP($V53,'Lookup Values'!$A$2:$A$402,'Lookup Values'!H$2:H$402)","v":"ERROR"},{"$f":"LOOKUP($V53,'Lookup Values'!$A$2:$A$402,'Lookup Values'!I$2:I$402)","v":"ERROR"},{"$f":"LOOKUP($V53,'Lookup Values'!$A$2:$A$402,'Lookup Values'!J$2:J$402)","v":"ERROR"},{"$f":"LOOKUP($V53,'Lookup Values'!$A$2:$A$402,'Lookup Values'!K$2:K$402)","v":"ERROR"},{"$f":"LOOKUP($V53,'Lookup Values'!$A$2:$A$402,'Lookup Values'!L$2:L$402)","v":"ERROR"},{"$f":"LOOKUP($V53,'Lookup Values'!$A$2:$A$402,'Lookup Values'!M$2:M$402)","v":"ERROR"},null,0,0,0,0,0,0,0,0,0,0,0,0,0,0,0,0,0,0,0,0,0,0,0,0,0,0,0,0,0,0,0,0,0,0,0,0,0,0,0,0,0,0,0,0,0,0,0,0,0,0,0,0,0,0,0,0,0,0,0,0,0,0,0,0,0,0,0,0,0,0,0,0,0,0,0,0,0,0,0,0,0,0,0,0,0,0,0,0,0,0,0,0,0,0,0,0,0,0,0,0,0,0,0,0,0,0,0,0,0,0,0,0,0,0,0,0,0,0,0,0,0,0,0,0,0,0,0,0,0,0,0,0,0,0,0,0]
[null,null,"","",null,null,null,null,"","","","","","","","","","","",null,null,{"$f":"IF(T54=\"\",402,MATCH(T54,'Lookup Values'!$B$1:$B$402,0))","v":402},{"$f":"LOOKUP($V54,'Lookup Values'!$A$2:$A$402,'Lookup Values'!C$2:C$402)","v":"ERROR"},{"$f":"LOOKUP($V54,'Lookup Values'!$A$2:$A$402,'Lookup Values'!D$2:D$402)","v":"ERROR"},{"$f":"LOOKUP($V54,'Lookup Values'!$A$2:$A$402,'Lookup Values'!E$2:E$402)","v":"ERROR"},{"$f":"LOOKUP($V54,'Lookup Values'!$A$2:$A$402,'Lookup Values'!F$2:F$402)","v":"ERROR"},{"$f":"LOOKUP($V54,'Lookup Values'!$A$2:$A$402,'Lookup Values'!G$2:G$402)","v":"ERROR"},{"$f":"LOOKUP($V54,'Lookup Values'!$A$2:$A$402,'Lookup Values'!H$2:H$402)","v":"ERROR"},{"$f":"LOOKUP($V54,'Lookup Values'!$A$2:$A$402,'Lookup Values'!I$2:I$402)","v":"ERROR"},{"$f":"LOOKUP($V54,'Lookup Values'!$A$2:$A$402,'Lookup Values'!J$2:J$402)","v":"ERROR"},{"$f":"LOOKUP($V54,'Lookup Values'!$A$2:$A$402,'Lookup Values'!K$2:K$402)","v":"ERROR"},{"$f":"LOOKUP($V54,'Lookup Values'!$A$2:$A$402,'Lookup Values'!L$2:L$402)","v":"ERROR"},{"$f":"LOOKUP($V54,'Lookup Values'!$A$2:$A$402,'Lookup Values'!M$2:M$402)","v":"ERROR"},null,0,0,0,0,0,0,0,0,0,0,0,0,0,0,0,0,0,0,0,0,0,0,0,0,0,0,0,0,0,0,0,0,0,0,0,0,0,0,0,0,0,0,0,0,0,0,0,0,0,0,0,0,0,0,0,0,0,0,0,0,0,0,0,0,0,0,0,0,0,0,0,0,0,0,0,0,0,0,0,0,0,0,0,0,0,0,0,0,0,0,0,0,0,0,0,0,0,0,0,0,0,0,0,0,0,0,0,0,0,0,0,0,0,0,0,0,0,0,0,0,0,0,0,0,0,0,0,0,0,0,0,0,0,0,0,0]
[null,null,"","",null,null,null,null,"","","","","","","","","","","",null,null,{"$f":"IF(T55=\"\",402,MATCH(T55,'Lookup Values'!$B$1:$B$402,0))","v":402},{"$f":"LOOKUP($V55,'Lookup Values'!$A$2:$A$402,'Lookup Values'!C$2:C$402)","v":"ERROR"},{"$f":"LOOKUP($V55,'Lookup Values'!$A$2:$A$402,'Lookup Values'!D$2:D$402)","v":"ERROR"},{"$f":"LOOKUP($V55,'Lookup Values'!$A$2:$A$402,'Lookup Values'!E$2:E$402)","v":"ERROR"},{"$f":"LOOKUP($V55,'Lookup Values'!$A$2:$A$402,'Lookup Values'!F$2:F$402)","v":"ERROR"},{"$f":"LOOKUP($V55,'Lookup Values'!$A$2:$A$402,'Lookup Values'!G$2:G$402)","v":"ERROR"},{"$f":"LOOKUP($V55,'Lookup Values'!$A$2:$A$402,'Lookup Values'!H$2:H$402)","v":"ERROR"},{"$f":"LOOKUP($V55,'Lookup Values'!$A$2:$A$402,'Lookup Values'!I$2:I$402)","v":"ERROR"},{"$f":"LOOKUP($V55,'Lookup Values'!$A$2:$A$402,'Lookup Values'!J$2:J$402)","v":"ERROR"},{"$f":"LOOKUP($V55,'Lookup Values'!$A$2:$A$402,'Lookup Values'!K$2:K$402)","v":"ERROR"},{"$f":"LOOKUP($V55,'Lookup Values'!$A$2:$A$402,'Lookup Values'!L$2:L$402)","v":"ERROR"},{"$f":"LOOKUP($V55,'Lookup Values'!$A$2:$A$402,'Lookup Values'!M$2:M$402)","v":"ERROR"},null,0,0,0,0,0,0,0,0,0,0,0,0,0,0,0,0,0,0,0,0,0,0,0,0,0,0,0,0,0,0,0,0,0,0,0,0,0,0,0,0,0,0,0,0,0,0,0,0,0,0,0,0,0,0,0,0,0,0,0,0,0,0,0,0,0,0,0,0,0,0,0,0,0,0,0,0,0,0,0,0,0,0,0,0,0,0,0,0,0,0,0,0,0,0,0,0,0,0,0,0,0,0,0,0,0,0,0,0,0,0,0,0,0,0,0,0,0,0,0,0,0,0,0,0,0,0,0,0,0,0,0,0,0,0,0,0]
[null,null,"","",null,null,null,null,"","","","","","","","","","","",null,null,{"$f":"IF(T56=\"\",402,MATCH(T56,'Lookup Values'!$B$1:$B$402,0))","v":402},{"$f":"LOOKUP($V56,'Lookup Values'!$A$2:$A$402,'Lookup Values'!C$2:C$402)","v":"ERROR"},{"$f":"LOOKUP($V56,'Lookup Values'!$A$2:$A$402,'Lookup Values'!D$2:D$402)","v":"ERROR"},{"$f":"LOOKUP($V56,'Lookup Values'!$A$2:$A$402,'Lookup Values'!E$2:E$402)","v":"ERROR"},{"$f":"LOOKUP($V56,'Lookup Values'!$A$2:$A$402,'Lookup Values'!F$2:F$402)","v":"ERROR"},{"$f":"LOOKUP($V56,'Lookup Values'!$A$2:$A$402,'Lookup Values'!G$2:G$402)","v":"ERROR"},{"$f":"LOOKUP($V56,'Lookup Values'!$A$2:$A$402,'Lookup Values'!H$2:H$402)","v":"ERROR"},{"$f":"LOOKUP($V56,'Lookup Values'!$A$2:$A$402,'Lookup Values'!I$2:I$402)","v":"ERROR"},{"$f":"LOOKUP($V56,'Lookup Values'!$A$2:$A$402,'Lookup Values'!J$2:J$402)","v":"ERROR"},{"$f":"LOOKUP($V56,'Lookup Values'!$A$2:$A$402,'Lookup Values'!K$2:K$402)","v":"ERROR"},{"$f":"LOOKUP($V56,'Lookup Values'!$A$2:$A$402,'Lookup Values'!L$2:L$402)","v":"ERROR"},{"$f":"LOOKUP($V56,'Lookup Values'!$A$2:$A$402,'Lookup Values'!M$2:M$402)","v":"ERROR"},null,0,0,0,0,0,0,0,0,0,0,0,0,0,0,0,0,0,0,0,0,0,0,0,0,0,0,0,0,0,0,0,0,0,0,0,0,0,0,0,0,0,0,0,0,0,0,0,0,0,0,0,0,0,0,0,0,0,0,0,0,0,0,0,0,0,0,0,0,0,0,0,0,0,0,0,0,0,0,0,0,0,0,0,0,0,0,0,0,0,0,0,0,0,0,0,0,0,0,0,0,0,0,0,0,0,0,0,0,0,0,0,0,0,0,0,0,0,0,0,0,0,0,0,0,0,0,0,0,0,0,0,0,0,0,0,0]
[null,null,"","",null,null,null,null,"","","","","","","","","","","",null,null,{"$f":"IF(T57=\"\",402,MATCH(T57,'Lookup Values'!$B$1:$B$402,0))","v":402},{"$f":"LOOKUP($V57,'Lookup Values'!$A$2:$A$402,'Lookup Values'!C$2:C$402)","v":"ERROR"},{"$f":"LOOKUP($V57,'Lookup Values'!$A$2:$A$402,'Lookup Values'!D$2:D$402)","v":"ERROR"},{"$f":"LOOKUP($V57,'Lookup Values'!$A$2:$A$402,'Lookup Values'!E$2:E$402)","v":"ERROR"},{"$f":"LOOKUP($V57,'Lookup Values'!$A$2:$A$402,'Lookup Values'!F$2:F$402)","v":"ERROR"},{"$f":"LOOKUP($V57,'Lookup Values'!$A$2:$A$402,'Lookup Values'!G$2:G$402)","v":"ERROR"},{"$f":"LOOKUP($V57,'Lookup Values'!$A$2:$A$402,'Lookup Values'!H$2:H$402)","v":"ERROR"},{"$f":"LOOKUP($V57,'Lookup Values'!$A$2:$A$402,'Lookup Values'!I$2:I$402)","v":"ERROR"},{"$f":"LOOKUP($V57,'Lookup Values'!$A$2:$A$402,'Lookup Values'!J$2:J$402)","v":"ERROR"},{"$f":"LOOKUP($V57,'Lookup Values'!$A$2:$A$402,'Lookup Values'!K$2:K$402)","v":"ERROR"},{"$f":"LOOKUP($V57,'Lookup Values'!$A$2:$A$402,'Lookup Values'!L$2:L$402)","v":"ERROR"},{"$f":"LOOKUP($V57,'Lookup Values'!$A$2:$A$402,'Lookup Values'!M$2:M$402)","v":"ERROR"},null,0,0,0,0,0,0,0,0,0,0,0,0,0,0,0,0,0,0,0,0,0,0,0,0,0,0,0,0,0,0,0,0,0,0,0,0,0,0,0,0,0,0,0,0,0,0,0,0,0,0,0,0,0,0,0,0,0,0,0,0,0,0,0,0,0,0,0,0,0,0,0,0,0,0,0,0,0,0,0,0,0,0,0,0,0,0,0,0,0,0,0,0,0,0,0,0,0,0,0,0,0,0,0,0,0,0,0,0,0,0,0,0,0,0,0,0,0,0,0,0,0,0,0,0,0,0,0,0,0,0,0,0,0,0,0,0]
[null,null,"","",null,null,null,null,"","","","","","","","","","","",null,null,{"$f":"IF(T58=\"\",402,MATCH(T58,'Lookup Values'!$B$1:$B$402,0))","v":402},{"$f":"LOOKUP($V58,'Lookup Values'!$A$2:$A$402,'Lookup Values'!C$2:C$402)","v":"ERROR"},{"$f":"LOOKUP($V58,'Lookup Values'!$A$2:$A$402,'Lookup Values'!D$2:D$402)","v":"ERROR"},{"$f":"LOOKUP($V58,'Lookup Values'!$A$2:$A$402,'Lookup Values'!E$2:E$402)","v":"ERROR"},{"$f":"LOOKUP($V58,'Lookup Values'!$A$2:$A$402,'Lookup Values'!F$2:F$402)","v":"ERROR"},{"$f":"LOOKUP($V58,'Lookup Values'!$A$2:$A$402,'Lookup Values'!G$2:G$402)","v":"ERROR"},{"$f":"LOOKUP($V58,'Lookup Values'!$A$2:$A$402,'Lookup Values'!H$2:H$402)","v":"ERROR"},{"$f":"LOOKUP($V58,'Lookup Values'!$A$2:$A$402,'Lookup Values'!I$2:I$402)","v":"ERROR"},{"$f":"LOOKUP($V58,'Lookup Values'!$A$2:$A$402,'Lookup Values'!J$2:J$402)","v":"ERROR"},{"$f":"LOOKUP($V58,'Lookup Values'!$A$2:$A$402,'Lookup Values'!K$2:K$402)","v":"ERROR"},{"$f":"LOOKUP($V58,'Lookup Values'!$A$2:$A$402,'Lookup Values'!L$2:L$402)","v":"ERROR"},{"$f":"LOOKUP($V58,'Lookup Values'!$A$2:$A$402,'Lookup Values'!M$2:M$402)","v":"ERROR"},null,0,0,0,0,0,0,0,0,0,0,0,0,0,0,0,0,0,0,0,0,0,0,0,0,0,0,0,0,0,0,0,0,0,0,0,0,0,0,0,0,0,0,0,0,0,0,0,0,0,0,0,0,0,0,0,0,0,0,0,0,0,0,0,0,0,0,0,0,0,0,0,0,0,0,0,0,0,0,0,0,0,0,0,0,0,0,0,0,0,0,0,0,0,0,0,0,0,0,0,0,0,0,0,0,0,0,0,0,0,0,0,0,0,0,0,0,0,0,0,0,0,0,0,0,0,0,0,0,0,0,0,0,0,0,0,0]
[null,null,"","",null,null,null,null,"","","","","","","","","","","",null,null,{"$f":"IF(T59=\"\",402,MATCH(T59,'Lookup Values'!$B$1:$B$402,0))","v":402},{"$f":"LOOKUP($V59,'Lookup Values'!$A$2:$A$402,'Lookup Values'!C$2:C$402)","v":"ERROR"},{"$f":"LOOKUP($V59,'Lookup Values'!$A$2:$A$402,'Lookup Values'!D$2:D$402)","v":"ERROR"},{"$f":"LOOKUP($V59,'Lookup Values'!$A$2:$A$402,'Lookup Values'!E$2:E$402)","v":"ERROR"},{"$f":"LOOKUP($V59,'Lookup Values'!$A$2:$A$402,'Lookup Values'!F$2:F$402)","v":"ERROR"},{"$f":"LOOKUP($V59,'Lookup Values'!$A$2:$A$402,'Lookup Values'!G$2:G$402)","v":"ERROR"},{"$f":"LOOKUP($V59,'Lookup Values'!$A$2:$A$402,'Lookup Values'!H$2:H$402)","v":"ERROR"},{"$f":"LOOKUP($V59,'Lookup Values'!$A$2:$A$402,'Lookup Values'!I$2:I$402)","v":"ERROR"},{"$f":"LOOKUP($V59,'Lookup Values'!$A$2:$A$402,'Lookup Values'!J$2:J$402)","v":"ERROR"},{"$f":"LOOKUP($V59,'Lookup Values'!$A$2:$A$402,'Lookup Values'!K$2:K$402)","v":"ERROR"},{"$f":"LOOKUP($V59,'Lookup Values'!$A$2:$A$402,'Lookup Values'!L$2:L$402)","v":"ERROR"},{"$f":"LOOKUP($V59,'Lookup Values'!$A$2:$A$402,'Lookup Values'!M$2:M$402)","v":"ERROR"},null,0,0,0,0,0,0,0,0,0,0,0,0,0,0,0,0,0,0,0,0,0,0,0,0,0,0,0,0,0,0,0,0,0,0,0,0,0,0,0,0,0,0,0,0,0,0,0,0,0,0,0,0,0,0,0,0,0,0,0,0,0,0,0,0,0,0,0,0,0,0,0,0,0,0,0,0,0,0,0,0,0,0,0,0,0,0,0,0,0,0,0,0,0,0,0,0,0,0,0,0,0,0,0,0,0,0,0,0,0,0,0,0,0,0,0,0,0,0,0,0,0,0,0,0,0,0,0,0,0,0,0,0,0,0,0,0]
[null,null,"","",null,null,null,null,"","","","","","","","","","","",null,null,{"$f":"IF(T60=\"\",402,MATCH(T60,'Lookup Values'!$B$1:$B$402,0))","v":402},{"$f":"LOOKUP($V60,'Lookup Values'!$A$2:$A$402,'Lookup Values'!C$2:C$402)","v":"ERROR"},{"$f":"LOOKUP($V60,'Lookup Values'!$A$2:$A$402,'Lookup Values'!D$2:D$402)","v":"ERROR"},{"$f":"LOOKUP($V60,'Lookup Values'!$A$2:$A$402,'Lookup Values'!E$2:E$402)","v":"ERROR"},{"$f":"LOOKUP($V60,'Lookup Values'!$A$2:$A$402,'Lookup Values'!F$2:F$402)","v":"ERROR"},{"$f":"LOOKUP($V60,'Lookup Values'!$A$2:$A$402,'Lookup Values'!G$2:G$402)","v":"ERROR"},{"$f":"LOOKUP($V60,'Lookup Values'!$A$2:$A$402,'Lookup Values'!H$2:H$402)","v":"ERROR"},{"$f":"LOOKUP($V60,'Lookup Values'!$A$2:$A$402,'Lookup Values'!I$2:I$402)","v":"ERROR"},{"$f":"LOOKUP($V60,'Lookup Values'!$A$2:$A$402,'Lookup Values'!J$2:J$402)","v":"ERROR"},{"$f":"LOOKUP($V60,'Lookup Values'!$A$2:$A$402,'Lookup Values'!K$2:K$402)","v":"ERROR"},{"$f":"LOOKUP($V60,'Lookup Values'!$A$2:$A$402,'Lookup Values'!L$2:L$402)","v":"ERROR"},{"$f":"LOOKUP($V60,'Lookup Values'!$A$2:$A$402,'Lookup Values'!M$2:M$402)","v":"ERROR"},null,0,0,0,0,0,0,0,0,0,0,0,0,0,0,0,0,0,0,0,0,0,0,0,0,0,0,0,0,0,0,0,0,0,0,0,0,0,0,0,0,0,0,0,0,0,0,0,0,0,0,0,0,0,0,0,0,0,0,0,0,0,0,0,0,0,0,0,0,0,0,0,0,0,0,0,0,0,0,0,0,0,0,0,0,0,0,0,0,0,0,0,0,0,0,0,0,0,0,0,0,0,0,0,0,0,0,0,0,0,0,0,0,0,0,0,0,0,0,0,0,0,0,0,0,0,0,0,0,0,0,0,0,0,0,0,0]
[null,null,"","",null,null,null,null,"","","","","","","","","","","",null,null,{"$f":"IF(T61=\"\",402,MATCH(T61,'Lookup Values'!$B$1:$B$402,0))","v":402},{"$f":"LOOKUP($V61,'Lookup Values'!$A$2:$A$402,'Lookup Values'!C$2:C$402)","v":"ERROR"},{"$f":"LOOKUP($V61,'Lookup Values'!$A$2:$A$402,'Lookup Values'!D$2:D$402)","v":"ERROR"},{"$f":"LOOKUP($V61,'Lookup Values'!$A$2:$A$402,'Lookup Values'!E$2:E$402)","v":"ERROR"},{"$f":"LOOKUP($V61,'Lookup Values'!$A$2:$A$402,'Lookup Values'!F$2:F$402)","v":"ERROR"},{"$f":"LOOKUP($V61,'Lookup Values'!$A$2:$A$402,'Lookup Values'!G$2:G$402)","v":"ERROR"},{"$f":"LOOKUP($V61,'Lookup Values'!$A$2:$A$402,'Lookup Values'!H$2:H$402)","v":"ERROR"},{"$f":"LOOKUP($V61,'Lookup Values'!$A$2:$A$402,'Lookup Values'!I$2:I$402)","v":"ERROR"},{"$f":"LOOKUP($V61,'Lookup Values'!$A$2:$A$402,'Lookup Values'!J$2:J$402)","v":"ERROR"},{"$f":"LOOKUP($V61,'Lookup Values'!$A$2:$A$402,'Lookup Values'!K$2:K$402)","v":"ERROR"},{"$f":"LOOKUP($V61,'Lookup Values'!$A$2:$A$402,'Lookup Values'!L$2:L$402)","v":"ERROR"},{"$f":"LOOKUP($V61,'Lookup Values'!$A$2:$A$402,'Lookup Values'!M$2:M$402)","v":"ERROR"},null,0,0,0,0,0,0,0,0,0,0,0,0,0,0,0,0,0,0,0,0,0,0,0,0,0,0,0,0,0,0,0,0,0,0,0,0,0,0,0,0,0,0,0,0,0,0,0,0,0,0,0,0,0,0,0,0,0,0,0,0,0,0,0,0,0,0,0,0,0,0,0,0,0,0,0,0,0,0,0,0,0,0,0,0,0,0,0,0,0,0,0,0,0,0,0,0,0,0,0,0,0,0,0,0,0,0,0,0,0,0,0,0,0,0,0,0,0,0,0,0,0,0,0,0,0,0,0,0,0,0,0,0,0,0,0,0]
[null,null,"","",null,null,null,null,"","","","","","","","","","","",null,null,{"$f":"IF(T62=\"\",402,MATCH(T62,'Lookup Values'!$B$1:$B$402,0))","v":402},{"$f":"LOOKUP($V62,'Lookup Values'!$A$2:$A$402,'Lookup Values'!C$2:C$402)","v":"ERROR"},{"$f":"LOOKUP($V62,'Lookup Values'!$A$2:$A$402,'Lookup Values'!D$2:D$402)","v":"ERROR"},{"$f":"LOOKUP($V62,'Lookup Values'!$A$2:$A$402,'Lookup Values'!E$2:E$402)","v":"ERROR"},{"$f":"LOOKUP($V62,'Lookup Values'!$A$2:$A$402,'Lookup Values'!F$2:F$402)","v":"ERROR"},{"$f":"LOOKUP($V62,'Lookup Values'!$A$2:$A$402,'Lookup Values'!G$2:G$402)","v":"ERROR"},{"$f":"LOOKUP($V62,'Lookup Values'!$A$2:$A$402,'Lookup Values'!H$2:H$402)","v":"ERROR"},{"$f":"LOOKUP($V62,'Lookup Values'!$A$2:$A$402,'Lookup Values'!I$2:I$402)","v":"ERROR"},{"$f":"LOOKUP($V62,'Lookup Values'!$A$2:$A$402,'Lookup Values'!J$2:J$402)","v":"ERROR"},{"$f":"LOOKUP($V62,'Lookup Values'!$A$2:$A$402,'Lookup Values'!K$2:K$402)","v":"ERROR"},{"$f":"LOOKUP($V62,'Lookup Values'!$A$2:$A$402,'Lookup Values'!L$2:L$402)","v":"ERROR"},{"$f":"LOOKUP($V62,'Lookup Values'!$A$2:$A$402,'Lookup Values'!M$2:M$402)","v":"ERROR"},null,0,0,0,0,0,0,0,0,0,0,0,0,0,0,0,0,0,0,0,0,0,0,0,0,0,0,0,0,0,0,0,0,0,0,0,0,0,0,0,0,0,0,0,0,0,0,0,0,0,0,0,0,0,0,0,0,0,0,0,0,0,0,0,0,0,0,0,0,0,0,0,0,0,0,0,0,0,0,0,0,0,0,0,0,0,0,0,0,0,0,0,0,0,0,0,0,0,0,0,0,0,0,0,0,0,0,0,0,0,0,0,0,0,0,0,0,0,0,0,0,0,0,0,0,0,0,0,0,0,0,0,0,0,0,0,0]
[null,null,"","",null,null,null,null,"","","","","","","","","","","",null,null,{"$f":"IF(T63=\"\",402,MATCH(T63,'Lookup Values'!$B$1:$B$402,0))","v":402},{"$f":"LOOKUP($V63,'Lookup Values'!$A$2:$A$402,'Lookup Values'!C$2:C$402)","v":"ERROR"},{"$f":"LOOKUP($V63,'Lookup Values'!$A$2:$A$402,'Lookup Values'!D$2:D$402)","v":"ERROR"},{"$f":"LOOKUP($V63,'Lookup Values'!$A$2:$A$402,'Lookup Values'!E$2:E$402)","v":"ERROR"},{"$f":"LOOKUP($V63,'Lookup Values'!$A$2:$A$402,'Lookup Values'!F$2:F$402)","v":"ERROR"},{"$f":"LOOKUP($V63,'Lookup Values'!$A$2:$A$402,'Lookup Values'!G$2:G$402)","v":"ERROR"},{"$f":"LOOKUP($V63,'Lookup Values'!$A$2:$A$402,'Lookup Values'!H$2:H$402)","v":"ERROR"},{"$f":"LOOKUP($V63,'Lookup Values'!$A$2:$A$402,'Lookup Values'!I$2:I$402)","v":"ERROR"},{"$f":"LOOKUP($V63,'Lookup Values'!$A$2:$A$402,'Lookup Values'!J$2:J$402)","v":"ERROR"},{"$f":"LOOKUP($V63,'Lookup Values'!$A$2:$A$402,'Lookup Values'!K$2:K$402)","v":"ERROR"},{"$f":"LOOKUP($V63,'Lookup Values'!$A$2:$A$402,'Lookup Values'!L$2:L$402)","v":"ERROR"},{"$f":"LOOKUP($V63,'Lookup Values'!$A$2:$A$402,'Lookup Values'!M$2:M$402)","v":"ERROR"},null,0,0,0,0,0,0,0,0,0,0,0,0,0,0,0,0,0,0,0,0,0,0,0,0,0,0,0,0,0,0,0,0,0,0,0,0,0,0,0,0,0,0,0,0,0,0,0,0,0,0,0,0,0,0,0,0,0,0,0,0,0,0,0,0,0,0,0,0,0,0,0,0,0,0,0,0,0,0,0,0,0,0,0,0,0,0,0,0,0,0,0,0,0,0,0,0,0,0,0,0,0,0,0,0,0,0,0,0,0,0,0,0,0,0,0,0,0,0,0,0,0,0,0,0,0,0,0,0,0,0,0,0,0,0,0,0]
[null,null,"","",null,null,null,null,"","","","","","","","","","","",null,null,{"$f":"IF(T64=\"\",402,MATCH(T64,'Lookup Values'!$B$1:$B$402,0))","v":402},{"$f":"LOOKUP($V64,'Lookup Values'!$A$2:$A$402,'Lookup Values'!C$2:C$402)","v":"ERROR"},{"$f":"LOOKUP($V64,'Lookup Values'!$A$2:$A$402,'Lookup Values'!D$2:D$402)","v":"ERROR"},{"$f":"LOOKUP($V64,'Lookup Values'!$A$2:$A$402,'Lookup Values'!E$2:E$402)","v":"ERROR"},{"$f":"LOOKUP($V64,'Lookup Values'!$A$2:$A$402,'Lookup Values'!F$2:F$402)","v":"ERROR"},{"$f":"LOOKUP($V64,'Lookup Values'!$A$2:$A$402,'Lookup Values'!G$2:G$402)","v":"ERROR"},{"$f":"LOOKUP($V64,'Lookup Values'!$A$2:$A$402,'Lookup Values'!H$2:H$402)","v":"ERROR"},{"$f":"LOOKUP($V64,'Lookup Values'!$A$2:$A$402,'Lookup Values'!I$2:I$402)","v":"ERROR"},{"$f":"LOOKUP($V64,'Lookup Values'!$A$2:$A$402,'Lookup Values'!J$2:J$402)","v":"ERROR"},{"$f":"LOOKUP($V64,'Lookup Values'!$A$2:$A$402,'Lookup Values'!K$2:K$402)","v":"ERROR"},{"$f":"LOOKUP($V64,'Lookup Values'!$A$2:$A$402,'Lookup Values'!L$2:L$402)","v":"ERROR"},{"$f":"LOOKUP($V64,'Lookup Values'!$A$2:$A$402,'Lookup Values'!M$2:M$402)","v":"ERROR"},null,0,0,0,0,0,0,0,0,0,0,0,0,0,0,0,0,0,0,0,0,0,0,0,0,0,0,0,0,0,0,0,0,0,0,0,0,0,0,0,0,0,0,0,0,0,0,0,0,0,0,0,0,0,0,0,0,0,0,0,0,0,0,0,0,0,0,0,0,0,0,0,0,0,0,0,0,0,0,0,0,0,0,0,0,0,0,0,0,0,0,0,0,0,0,0,0,0,0,0,0,0,0,0,0,0,0,0,0,0,0,0,0,0,0,0,0,0,0,0,0,0,0,0,0,0,0,0,0,0,0,0,0,0,0,0,0]
[null,null,"","",null,null,null,null,"","","","","","","","","","","",null,null,{"$f":"IF(T65=\"\",402,MATCH(T65,'Lookup Values'!$B$1:$B$402,0))","v":402},{"$f":"LOOKUP($V65,'Lookup Values'!$A$2:$A$402,'Lookup Values'!C$2:C$402)","v":"ERROR"},{"$f":"LOOKUP($V65,'Lookup Values'!$A$2:$A$402,'Lookup Values'!D$2:D$402)","v":"ERROR"},{"$f":"LOOKUP($V65,'Lookup Values'!$A$2:$A$402,'Lookup Values'!E$2:E$402)","v":"ERROR"},{"$f":"LOOKUP($V65,'Lookup Values'!$A$2:$A$402,'Lookup Values'!F$2:F$402)","v":"ERROR"},{"$f":"LOOKUP($V65,'Lookup Values'!$A$2:$A$402,'Lookup Values'!G$2:G$402)","v":"ERROR"},{"$f":"LOOKUP($V65,'Lookup Values'!$A$2:$A$402,'Lookup Values'!H$2:H$402)","v":"ERROR"},{"$f":"LOOKUP($V65,'Lookup Values'!$A$2:$A$402,'Lookup Values'!I$2:I$402)","v":"ERROR"},{"$f":"LOOKUP($V65,'Lookup Values'!$A$2:$A$402,'Lookup Values'!J$2:J$402)","v":"ERROR"},{"$f":"LOOKUP($V65,'Lookup Values'!$A$2:$A$402,'Lookup Values'!K$2:K$402)","v":"ERROR"},{"$f":"LOOKUP($V65,'Lookup Values'!$A$2:$A$402,'Lookup Values'!L$2:L$402)","v":"ERROR"},{"$f":"LOOKUP($V65,'Lookup Values'!$A$2:$A$402,'Lookup Values'!M$2:M$402)","v":"ERROR"},null,0,0,0,0,0,0,0,0,0,0,0,0,0,0,0,0,0,0,0,0,0,0,0,0,0,0,0,0,0,0,0,0,0,0,0,0,0,0,0,0,0,0,0,0,0,0,0,0,0,0,0,0,0,0,0,0,0,0,0,0,0,0,0,0,0,0,0,0,0,0,0,0,0,0,0,0,0,0,0,0,0,0,0,0,0,0,0,0,0,0,0,0,0,0,0,0,0,0,0,0,0,0,0,0,0,0,0,0,0,0,0,0,0,0,0,0,0,0,0,0,0,0,0,0,0,0,0,0,0,0,0,0,0,0,0,0]
[null,null,"","",null,null,null,null,"","","","","","","","","","","",null,null,{"$f":"IF(T66=\"\",402,MATCH(T66,'Lookup Values'!$B$1:$B$402,0))","v":402},{"$f":"LOOKUP($V66,'Lookup Values'!$A$2:$A$402,'Lookup Values'!C$2:C$402)","v":"ERROR"},{"$f":"LOOKUP($V66,'Lookup Values'!$A$2:$A$402,'Lookup Values'!D$2:D$402)","v":"ERROR"},{"$f":"LOOKUP($V66,'Lookup Values'!$A$2:$A$402,'Lookup Values'!E$2:E$402)","v":"ERROR"},{"$f":"LOOKUP($V66,'Lookup Values'!$A$2:$A$402,'Lookup Values'!F$2:F$402)","v":"ERROR"},{"$f":"LOOKUP($V66,'Lookup Values'!$A$2:$A$402,'Lookup Values'!G$2:G$402)","v":"ERROR"},{"$f":"LOOKUP($V66,'Lookup Values'!$A$2:$A$402,'Lookup Values'!H$2:H$402)","v":"ERROR"},{"$f":"LOOKUP($V66,'Lookup Values'!$A$2:$A$402,'Lookup Values'!I$2:I$402)","v":"ERROR"},{"$f":"LOOKUP($V66,'Lookup Values'!$A$2:$A$402,'Lookup Values'!J$2:J$402)","v":"ERROR"},{"$f":"LOOKUP($V66,'Lookup Values'!$A$2:$A$402,'Lookup Values'!K$2:K$402)","v":"ERROR"},{"$f":"LOOKUP($V66,'Lookup Values'!$A$2:$A$402,'Lookup Values'!L$2:L$402)","v":"ERROR"},{"$f":"LOOKUP($V66,'Lookup Values'!$A$2:$A$402,'Lookup Values'!M$2:M$402)","v":"ERROR"},null,0,0,0,0,0,0,0,0,0,0,0,0,0,0,0,0,0,0,0,0,0,0,0,0,0,0,0,0,0,0,0,0,0,0,0,0,0,0,0,0,0,0,0,0,0,0,0,0,0,0,0,0,0,0,0,0,0,0,0,0,0,0,0,0,0,0,0,0,0,0,0,0,0,0,0,0,0,0,0,0,0,0,0,0,0,0,0,0,0,0,0,0,0,0,0,0,0,0,0,0,0,0,0,0,0,0,0,0,0,0,0,0,0,0,0,0,0,0,0,0,0,0,0,0,0,0,0,0,0,0,0,0,0,0,0,0]
[null,null,"","",null,null,null,null,"","","","","","","","","","","",null,null,{"$f":"IF(T67=\"\",402,MATCH(T67,'Lookup Values'!$B$1:$B$402,0))","v":402},{"$f":"LOOKUP($V67,'Lookup Values'!$A$2:$A$402,'Lookup Values'!C$2:C$402)","v":"ERROR"},{"$f":"LOOKUP($V67,'Lookup Values'!$A$2:$A$402,'Lookup Values'!D$2:D$402)","v":"ERROR"},{"$f":"LOOKUP($V67,'Lookup Values'!$A$2:$A$402,'Lookup Values'!E$2:E$402)","v":"ERROR"},{"$f":"LOOKUP($V67,'Lookup Values'!$A$2:$A$402,'Lookup Values'!F$2:F$402)","v":"ERROR"},{"$f":"LOOKUP($V67,'Lookup Values'!$A$2:$A$402,'Lookup Values'!G$2:G$402)","v":"ERROR"},{"$f":"LOOKUP($V67,'Lookup Values'!$A$2:$A$402,'Lookup Values'!H$2:H$402)","v":"ERROR"},{"$f":"LOOKUP($V67,'Lookup Values'!$A$2:$A$402,'Lookup Values'!I$2:I$402)","v":"ERROR"},{"$f":"LOOKUP($V67,'Lookup Values'!$A$2:$A$402,'Lookup Values'!J$2:J$402)","v":"ERROR"},{"$f":"LOOKUP($V67,'Lookup Values'!$A$2:$A$402,'Lookup Values'!K$2:K$402)","v":"ERROR"},{"$f":"LOOKUP($V67,'Lookup Values'!$A$2:$A$402,'Lookup Values'!L$2:L$402)","v":"ERROR"},{"$f":"LOOKUP($V67,'Lookup Values'!$A$2:$A$402,'Lookup Values'!M$2:M$402)","v":"ERROR"},null,0,0,0,0,0,0,0,0,0,0,0,0,0,0,0,0,0,0,0,0,0,0,0,0,0,0,0,0,0,0,0,0,0,0,0,0,0,0,0,0,0,0,0,0,0,0,0,0,0,0,0,0,0,0,0,0,0,0,0,0,0,0,0,0,0,0,0,0,0,0,0,0,0,0,0,0,0,0,0,0,0,0,0,0,0,0,0,0,0,0,0,0,0,0,0,0,0,0,0,0,0,0,0,0,0,0,0,0,0,0,0,0,0,0,0,0,0,0,0,0,0,0,0,0,0,0,0,0,0,0,0,0,0,0,0,0]
[null,null,"","",null,null,null,null,"","","","","","","","","","","",null,null,{"$f":"IF(T68=\"\",402,MATCH(T68,'Lookup Values'!$B$1:$B$402,0))","v":402},{"$f":"LOOKUP($V68,'Lookup Values'!$A$2:$A$402,'Lookup Values'!C$2:C$402)","v":"ERROR"},{"$f":"LOOKUP($V68,'Lookup Values'!$A$2:$A$402,'Lookup Values'!D$2:D$402)","v":"ERROR"},{"$f":"LOOKUP($V68,'Lookup Values'!$A$2:$A$402,'Lookup Values'!E$2:E$402)","v":"ERROR"},{"$f":"LOOKUP($V68,'Lookup Values'!$A$2:$A$402,'Lookup Values'!F$2:F$402)","v":"ERROR"},{"$f":"LOOKUP($V68,'Lookup Values'!$A$2:$A$402,'Lookup Values'!G$2:G$402)","v":"ERROR"},{"$f":"LOOKUP($V68,'Lookup Values'!$A$2:$A$402,'Lookup Values'!H$2:H$402)","v":"ERROR"},{"$f":"LOOKUP($V68,'Lookup Values'!$A$2:$A$402,'Lookup Values'!I$2:I$402)","v":"ERROR"},{"$f":"LOOKUP($V68,'Lookup Values'!$A$2:$A$402,'Lookup Values'!J$2:J$402)","v":"ERROR"},{"$f":"LOOKUP($V68,'Lookup Values'!$A$2:$A$402,'Lookup Values'!K$2:K$402)","v":"ERROR"},{"$f":"LOOKUP($V68,'Lookup Values'!$A$2:$A$402,'Lookup Values'!L$2:L$402)","v":"ERROR"},{"$f":"LOOKUP($V68,'Lookup Values'!$A$2:$A$402,'Lookup Values'!M$2:M$402)","v":"ERROR"},null,0,0,0,0,0,0,0,0,0,0,0,0,0,0,0,0,0,0,0,0,0,0,0,0,0,0,0,0,0,0,0,0,0,0,0,0,0,0,0,0,0,0,0,0,0,0,0,0,0,0,0,0,0,0,0,0,0,0,0,0,0,0,0,0,0,0,0,0,0,0,0,0,0,0,0,0,0,0,0,0,0,0,0,0,0,0,0,0,0,0,0,0,0,0,0,0,0,0,0,0,0,0,0,0,0,0,0,0,0,0,0,0,0,0,0,0,0,0,0,0,0,0,0,0,0,0,0,0,0,0,0,0,0,0,0,0]
[null,null,"","",null,null,null,null,"","","","","","","","","","","",null,null,{"$f":"IF(T69=\"\",402,MATCH(T69,'Lookup Values'!$B$1:$B$402,0))","v":402},{"$f":"LOOKUP($V69,'Lookup Values'!$A$2:$A$402,'Lookup Values'!C$2:C$402)","v":"ERROR"},{"$f":"LOOKUP($V69,'Lookup Values'!$A$2:$A$402,'Lookup Values'!D$2:D$402)","v":"ERROR"},{"$f":"LOOKUP($V69,'Lookup Values'!$A$2:$A$402,'Lookup Values'!E$2:E$402)","v":"ERROR"},{"$f":"LOOKUP($V69,'Lookup Values'!$A$2:$A$402,'Lookup Values'!F$2:F$402)","v":"ERROR"},{"$f":"LOOKUP($V69,'Lookup Values'!$A$2:$A$402,'Lookup Values'!G$2:G$402)","v":"ERROR"},{"$f":"LOOKUP($V69,'Lookup Values'!$A$2:$A$402,'Lookup Values'!H$2:H$402)","v":"ERROR"},{"$f":"LOOKUP($V69,'Lookup Values'!$A$2:$A$402,'Lookup Values'!I$2:I$402)","v":"ERROR"},{"$f":"LOOKUP($V69,'Lookup Values'!$A$2:$A$402,'Lookup Values'!J$2:J$402)","v":"ERROR"},{"$f":"LOOKUP($V69,'Lookup Values'!$A$2:$A$402,'Lookup Values'!K$2:K$402)","v":"ERROR"},{"$f":"LOOKUP($V69,'Lookup Values'!$A$2:$A$402,'Lookup Values'!L$2:L$402)","v":"ERROR"},{"$f":"LOOKUP($V69,'Lookup Values'!$A$2:$A$402,'Lookup Values'!M$2:M$402)","v":"ERROR"},null,0,0,0,0,0,0,0,0,0,0,0,0,0,0,0,0,0,0,0,0,0,0,0,0,0,0,0,0,0,0,0,0,0,0,0,0,0,0,0,0,0,0,0,0,0,0,0,0,0,0,0,0,0,0,0,0,0,0,0,0,0,0,0,0,0,0,0,0,0,0,0,0,0,0,0,0,0,0,0,0,0,0,0,0,0,0,0,0,0,0,0,0,0,0,0,0,0,0,0,0,0,0,0,0,0,0,0,0,0,0,0,0,0,0,0,0,0,0,0,0,0,0,0,0,0,0,0,0,0,0,0,0,0,0,0,0]
[null,null,"","",null,null,null,null,"","","","","","","","","","","",null,null,{"$f":"IF(T70=\"\",402,MATCH(T70,'Lookup Values'!$B$1:$B$402,0))","v":402},{"$f":"LOOKUP($V70,'Lookup Values'!$A$2:$A$402,'Lookup Values'!C$2:C$402)","v":"ERROR"},{"$f":"LOOKUP($V70,'Lookup Values'!$A$2:$A$402,'Lookup Values'!D$2:D$402)","v":"ERROR"},{"$f":"LOOKUP($V70,'Lookup Values'!$A$2:$A$402,'Lookup Values'!E$2:E$402)","v":"ERROR"},{"$f":"LOOKUP($V70,'Lookup Values'!$A$2:$A$402,'Lookup Values'!F$2:F$402)","v":"ERROR"},{"$f":"LOOKUP($V70,'Lookup Values'!$A$2:$A$402,'Lookup Values'!G$2:G$402)","v":"ERROR"},{"$f":"LOOKUP($V70,'Lookup Values'!$A$2:$A$402,'Lookup Values'!H$2:H$402)","v":"ERROR"},{"$f":"LOOKUP($V70,'Lookup Values'!$A$2:$A$402,'Lookup Values'!I$2:I$402)","v":"ERROR"},{"$f":"LOOKUP($V70,'Lookup Values'!$A$2:$A$402,'Lookup Values'!J$2:J$402)","v":"ERROR"},{"$f":"LOOKUP($V70,'Lookup Values'!$A$2:$A$402,'Lookup Values'!K$2:K$402)","v":"ERROR"},{"$f":"LOOKUP($V70,'Lookup Values'!$A$2:$A$402,'Lookup Values'!L$2:L$402)","v":"ERROR"},{"$f":"LOOKUP($V70,'Lookup Values'!$A$2:$A$402,'Lookup Values'!M$2:M$402)","v":"ERROR"},null,{"$f":"IF(T70=\"TYP. NO. 1\",D70,0)","v":0},{"$f":"IF(T70=\"TYP. NO. 2\",D70,0)","v":0},{"$f":"IF(T70=\"TRANS. TYP. NO. 1 TO TYP. NO. 2\",D70,IF(T70=\"TRANS. TYP. NO. 2 TO TYP. NO. 1\",D70,0))","v":0},{"$f":"IF(T70=\"TYP. NO. 3\",D70,0)","v":0},{"$f":"IF(T70=\"TRANS. TYP. NO. 1 TO TYP. NO. 3\",D70,IF(T70=\"TRANS. TYP. NO. 3 TO TYP. NO. 1\",D70,0))","v":0},{"$f":"IF(T70=\"TRANS. TYP. NO. 2 TO TYP. NO. 3\",D70,IF(T70=\"TRANS. TYP. NO. 3 TO TYP. NO. 2\",D70,0))","v":0},{"$f":"IF(T70=\"TYP. NO. 4\",D70,0)","v":0},{"$f":"IF(T70=\"TRANS. TYP. NO. 1 TO TYP. NO. 4\",D70,IF(T70=\"TRANS. TYP. NO. 4 TO TYP. NO. 1\",D70,0))","v":0},{"$f":"IF(T70=\"TRANS. TYP. NO. 2 TO TYP. NO. 4\",D70,IF(T70=\"TRANS. TYP. NO. 4 TO TYP. NO. 2\",D70,0))","v":0},{"$f":"IF(T70=\"TRANS. TYP. NO. 3 TO TYP. NO. 4\",D70,IF(T70=\"TRANS. TYP. NO. 4 TO TYP. NO. 3\",D70,0))","v":0},{"$f":"IF(T70=\"TYP. NO. 5\",D70,0)","v":0},{"$f":"IF(T70=\"TRANS. TYP. NO. 1 TO TYP. NO. 5\",D70,IF(T70=\"TRANS. TYP. NO. 5 TO TYP. NO. 1\",D70,0))","v":0},{"$f":"IF(T70=\"TRANS. TYP. NO. 2 TO TYP. NO. 5\",D70,IF(T70=\"TRANS. TYP. NO. 5 TO TYP. NO. 2\",D70,0))","v":0},{"$f":"IF(T70=\"TRANS. TYP. NO. 3 TO TYP. NO. 5\",D70,IF(T70=\"TRANS. TYP. NO. 5 TO TYP. NO. 3\",D70,0))","v":0},{"$f":"IF(T70=\"TRANS. TYP. NO. 4 TO TYP. NO. 5\",D70,IF(T70=\"TRANS. TYP. NO. 5 TO TYP. NO. 4\",D70,0))","v":0},{"$f":"IF(T70=\"TYP. NO. 6\",D70,0)","v":0},{"$f":"IF(T70=\"TRANS. TYP. NO. 1 TO TYP. NO. 6\",D70,IF(T70=\"TRANS. TYP. NO. 6 TO TYP. NO. 1\",D70,0))","v":0},{"$f":"IF(T70=\"TRANS. TYP. NO. 2 TO TYP. NO. 6\",D70,IF(T70=\"TRANS. TYP. NO. 6 TO TYP. NO. 2\",D70,0))","v":0},{"$f":"IF(T70=\"TRANS. TYP. NO. 3 TO TYP. NO. 6\",D70,IF(T70=\"TRANS. TYP. NO. 6 TO TYP. NO. 3\",D70,0))","v":0},{"$f":"IF(T70=\"TRANS. TYP. NO. 4 TO TYP. NO. 6\",D70,IF(T70=\"TRANS. TYP. NO. 6 TO TYP. NO. 4\",D70,0))","v":0},{"$f":"IF(T70=\"TRANS. TYP. NO. 5 TO TYP. NO. 6\",D70,IF(T70=\"TRANS. TYP. NO. 6 TO TYP. NO. 5\",D70,0))","v":0},{"$f":"IF(T70=\"TYP. NO. 7\",D70,0)","v":0},{"$f":"IF(T70=\"TRANS. TYP. NO. 1 TO TYP. NO. 7\",D70,IF(T70=\"TRANS. TYP. NO. 7 TO TYP. NO. 1\",D70,0))","v":0},{"$f":"IF(T70=\"TRANS. TYP. NO. 2 TO TYP. NO. 7\",D70,IF(T70=\"TRANS. TYP. NO. 7 TO TYP. NO. 2\",D70,0))","v":0},{"$f":"IF(T70=\"TRANS. TYP. NO. 3 TO TYP. NO. 7\",D70,IF(T70=\"TRANS. TYP. NO. 7 TO TYP. NO. 3\",D70,0))","v":0},{"$f":"IF(T70=\"TRANS. TYP. NO. 4 TO TYP. NO. 7\",D70,IF(T70=\"TRANS. TYP. NO. 7 TO TYP. NO. 4\",D70,0))","v":0},{"$f":"IF(T70=\"TRANS. TYP. NO. 5 TO TYP. NO. 7\",D70,IF(T70=\"TRANS. TYP. NO. 7 TO TYP. NO. 5\",D70,0))","v":0},{"$f":"IF(T70=\"TRANS. TYP. NO. 6 TO TYP. NO. 7\",D70,IF(T70=\"TRANS. TYP. NO. 7 TO TYP. NO. 6\",D70,0))","v":0},{"$f":"IF(T70=\"TYP. NO. 8\",D70,0)","v":0},{"$f":"IF($T70=\"TRANS. TYP. NO. 1 TO TYP. NO. 8\",$D70,IF($T70=\"TRANS. TYP. NO. 8 TO TYP. NO. 1\",$D70,0))","v":0},{"$f":"IF($T70=\"TRANS. TYP. NO. 2 TO TYP. NO. 8\",$D70,IF($T70=\"TRANS. TYP. NO. 8 TO TYP. NO. 2\",$D70,0))","v":0},{"$f":"IF($T70=\"TRANS. TYP. NO. 3 TO TYP. NO. 8\",$D70,IF($T70=\"TRANS. TYP. NO. 8 TO TYP. NO. 3\",$D70,0))","v":0},{"$f":"IF($T70=\"TRANS. TYP. NO. 4 TO TYP. NO. 8\",$D70,IF($T70=\"TRANS. TYP. NO. 8 TO TYP. NO. 4\",$D70,0))","v":0},{"$f":"IF($T70=\"TRANS. TYP. NO. 5 TO TYP. NO. 8\",$D70,IF($T70=\"TRANS. TYP. NO. 8 TO TYP. NO. 5\",$D70,0))","v":0},{"$f":"IF($T70=\"TRANS. TYP. NO. 6 TO TYP. NO. 8\",$D70,IF($T70=\"TRANS. TYP. NO. 8 TO TYP. NO. 6\",$D70,0))","v":0},{"$f":"IF($T70=\"TRANS. TYP. NO. 7 TO TYP. NO. 8\",$D70,IF($T70=\"TRANS. TYP. NO. 8 TO TYP. NO. 7\",$D70,0))","v":0},{"$f":"IF(T70=\"TYP. NO. 9\",D70,0)","v":0},{"$f":"IF($T70=\"TRANS. TYP. NO. 1 TO TYP. NO. 9\",$D70,IF($T70=\"TRANS. TYP. NO. 9 TO TYP. NO. 1\",$D70,0))","v":0},{"$f":"IF($T70=\"TRANS. TYP. NO. 2 TO TYP. NO. 9\",$D70,IF($T70=\"TRANS. TYP. NO. 9 TO TYP. NO. 2\",$D70,0))","v":0},{"$f":"IF($T70=\"TRANS. TYP. NO. 3 TO TYP. NO. 9\",$D70,IF($T70=\"TRANS. TYP. NO. 9 TO TYP. NO. 3\",$D70,0))","v":0},{"$f":"IF($T70=\"TRANS. TYP. NO. 4 TO TYP. NO. 9\",$D70,IF($T70=\"TRANS. TYP. NO. 9 TO TYP. NO. 4\",$D70,0))","v":0},{"$f":"IF($T70=\"TRANS. TYP. NO. 5 TO TYP. NO. 9\",$D70,IF($T70=\"TRANS. TYP. NO. 9 TO TYP. NO. 5\",$D70,0))","v":0},{"$f":"IF($T70=\"TRANS. TYP. NO. 6 TO TYP. NO. 9\",$D70,IF($T70=\"TRANS. TYP. NO. 9 TO TYP. NO. 6\",$D70,0))","v":0},{"$f":"IF($T70=\"TRANS. TYP. NO. 7 TO TYP. NO. 9\",$D70,IF($T70=\"TRANS. TYP. NO. 9 TO TYP. NO. 7\",$D70,0))","v":0},{"$f":"IF($T70=\"TRANS. TYP. NO. 8 TO TYP. NO. 9\",$D70,IF($T70=\"TRANS. TYP. NO. 9 TO TYP. NO. 8\",$D70,0))","v":0},{"$f":"IF(T70=\"TYP. NO. 10\",D70,0)","v":0},{"$f":"IF($T70=\"TRANS. TYP. NO. 1 TO TYP. NO. 10\",$D70,IF($T70=\"TRANS. TYP. NO. 10 TO TYP. NO. 1\",$D70,0))","v":0},{"$f":"IF($T70=\"TRANS. TYP. NO. 2 TO TYP. NO. 10\",$D70,IF($T70=\"TRANS. TYP. NO. 10 TO TYP. NO. 2\",$D70,0))","v":0},{"$f":"IF($T70=\"TRANS. TYP. NO. 3 TO TYP. NO. 10\",$D70,IF($T70=\"TRANS. TYP. NO. 10 TO TYP. NO. 3\",$D70,0))","v":0},{"$f":"IF($T70=\"TRANS. TYP. NO. 4 TO TYP. NO. 10\",$D70,IF($T70=\"TRANS. TYP. NO. 10 TO TYP. NO. 4\",$D70,0))","v":0},{"$f":"IF($T70=\"TRANS. TYP. NO. 5 TO TYP. NO. 10\",$D70,IF($T70=\"TRANS. TYP. NO. 10 TO TYP. NO. 5\",$D70,0))","v":0},{"$f":"IF($T70=\"TRANS. TYP. NO. 6 TO TYP. NO. 10\",$D70,IF($T70=\"TRANS. TYP. NO. 10 TO TYP. NO. 6\",$D70,0))","v":0},{"$f":"IF($T70=\"TRANS. TYP. NO. 7 TO TYP. NO. 10\",$D70,IF($T70=\"TRANS. TYP. NO. 10 TO TYP. NO. 7\",$D70,0))","v":0},{"$f":"IF($T70=\"TRANS. TYP. NO. 8 TO TYP. NO. 10\",$D70,IF($T70=\"TRANS. TYP. NO. 10 TO TYP. NO. 8\",$D70,0))","v":0},{"$f":"IF($T70=\"TRANS. TYP. NO. 9 TO TYP. NO. 10\",$D70,IF($T70=\"TRANS. TYP. NO. 10 TO TYP. NO. 9\",$D70,0))","v":0},{"$f":"IF(T70=\"TYP. NO. 11\",D70,0)","v":0},{"$f":"IF($T70=\"TRANS. TYP. NO. 1 TO TYP. NO. 11\",$D70,IF($T70=\"TRANS. TYP. NO. 11 TO TYP. NO. 1\",$D70,0))","v":0},{"$f":"IF($T70=\"TRANS. TYP. NO. 2 TO TYP. NO. 11\",$D70,IF($T70=\"TRANS. TYP. NO. 11 TO TYP. NO. 2\",$D70,0))","v":0},{"$f":"IF($T70=\"TRANS. TYP. NO. 3 TO TYP. NO. 11\",$D70,IF($T70=\"TRANS. TYP. NO. 11 TO TYP. NO. 3\",$D70,0))","v":0},{"$f":"IF($T70=\"TRANS. TYP. NO. 4 TO TYP. NO. 11\",$D70,IF($T70=\"TRANS. TYP. NO. 11 TO TYP. NO. 4\",$D70,0))","v":0},{"$f":"IF($T70=\"TRANS. TYP. NO. 5 TO TYP. NO. 11\",$D70,IF($T70=\"TRANS. TYP. NO. 11 TO TYP. NO. 5\",$D70,0))","v":0},{"$f":"IF($T70=\"TRANS. TYP. NO. 6 TO TYP. NO. 11\",$D70,IF($T70=\"TRANS. TYP. NO. 11 TO TYP. NO. 6\",$D70,0))","v":0},{"$f":"IF($T70=\"TRANS. TYP. NO. 7 TO TYP. NO. 11\",$D70,IF($T70=\"TRANS. TYP. NO. 11 TO TYP. NO. 7\",$D70,0))","v":0},{"$f":"IF($T70=\"TRANS. TYP. NO. 8 TO TYP. NO. 11\",$D70,IF($T70=\"TRANS. TYP. NO. 11 TO TYP. NO. 8\",$D70,0))","v":0},{"$f":"IF($T70=\"TRANS. TYP. NO. 9 TO TYP. NO. 11\",$D70,IF($T70=\"TRANS. TYP. NO. 11 TO TYP. NO. 9\",$D70,0))","v":0},{"$f":"IF($T70=\"TRANS. TYP. NO. 10 TO TYP. NO. 11\",$D70,IF($T70=\"TRANS. TYP. NO. 11 TO TYP. NO. 10\",$D70,0))","v":0},{"$f":"IF(T70=\"TYP. NO. 12\",D70,0)","v":0},{"$f":"IF($T70=\"TRANS. TYP. NO. 1 TO TYP. NO. 12\",$D70,IF($T70=\"TRANS. TYP. NO. 12 TO TYP. NO. 1\",$D70,0))","v":0},{"$f":"IF($T70=\"TRANS. TYP. NO. 2 TO TYP. NO. 12\",$D70,IF($T70=\"TRANS. TYP. NO. 12 TO TYP. NO. 2\",$D70,0))","v":0},{"$f":"IF($T70=\"TRANS. TYP. NO. 3 TO TYP. NO. 12\",$D70,IF($T70=\"TRANS. TYP. NO. 12 TO TYP. NO. 3\",$D70,0))","v":0},{"$f":"IF($T70=\"TRANS. TYP. NO. 4 TO TYP. NO. 12\",$D70,IF($T70=\"TRANS. TYP. NO. 12 TO TYP. NO. 4\",$D70,0))","v":0},{"$f":"IF($T70=\"TRANS. TYP. NO. 5 TO TYP. NO. 12\",$D70,IF($T70=\"TRANS. TYP. NO. 12 TO TYP. NO. 5\",$D70,0))","v":0},{"$f":"IF($T70=\"TRANS. TYP. NO. 6 TO TYP. NO. 12\",$D70,IF($T70=\"TRANS. TYP. NO. 12 TO TYP. NO. 6\",$D70,0))","v":0},{"$f":"IF($T70=\"TRANS. TYP. NO. 7 TO TYP. NO. 12\",$D70,IF($T70=\"TRANS. TYP. NO. 12 TO TYP. NO. 7\",$D70,0))","v":0},{"$f":"IF($T70=\"TRANS. TYP. NO. 8 TO TYP. NO. 12\",$D70,IF($T70=\"TRANS. TYP. NO. 12 TO TYP. NO. 8\",$D70,0))","v":0},{"$f":"IF($T70=\"TRANS. TYP. NO. 9 TO TYP. NO. 12\",$D70,IF($T70=\"TRANS. TYP. NO. 12 TO TYP. NO. 9\",$D70,0))","v":0},{"$f":"IF($T70=\"TRANS. TYP. NO. 10 TO TYP. NO. 12\",$D70,IF($T70=\"TRANS. TYP. NO. 12 TO TYP. NO. 10\",$D70,0))","v":0},{"$f":"IF($T70=\"TRANS. TYP. NO. 11 TO TYP. NO. 12\",$D70,IF($T70=\"TRANS. TYP. NO. 12 TO TYP. NO. 11\",$D70,0))","v":0},{"$f":"IF(T70=\"TYP. NO. 13\",D70,0)","v":0},{"$f":"IF($T70=\"TRANS. TYP. NO. 1 TO TYP. NO. 13\",$D70,IF($T70=\"TRANS. TYP. NO. 13 TO TYP. NO. 1\",$D70,0))","v":0},{"$f":"IF($T70=\"TRANS. TYP. NO. 2 TO TYP. NO. 13\",$D70,IF($T70=\"TRANS. TYP. NO. 13 TO TYP. NO. 2\",$D70,0))","v":0},{"$f":"IF($T70=\"TRANS. TYP. NO. 3 TO TYP. NO. 13\",$D70,IF($T70=\"TRANS. TYP. NO. 13 TO TYP. NO. 3\",$D70,0))","v":0},{"$f":"IF($T70=\"TRANS. TYP. NO. 4 TO TYP. NO. 13\",$D70,IF($T70=\"TRANS. TYP. NO. 13 TO TYP. NO. 4\",$D70,0))","v":0},{"$f":"IF($T70=\"TRANS. TYP. NO. 5 TO TYP. NO. 13\",$D70,IF($T70=\"TRANS. TYP. NO. 13 TO TYP. NO. 5\",$D70,0))","v":0},{"$f":"IF($T70=\"TRANS. TYP. NO. 6 TO TYP. NO. 13\",$D70,IF($T70=\"TRANS. TYP. NO. 13 TO TYP. NO. 6\",$D70,0))","v":0},{"$f":"IF($T70=\"TRANS. TYP. NO. 7 TO TYP. NO. 13\",$D70,IF($T70=\"TRANS. TYP. NO. 13 TO TYP. NO. 7\",$D70,0))","v":0},{"$f":"IF($T70=\"TRANS. TYP. NO. 8 TO TYP. NO. 13\",$D70,IF($T70=\"TRANS. TYP. NO. 13 TO TYP. NO. 8\",$D70,0))","v":0},{"$f":"IF($T70=\"TRANS. TYP. NO. 9 TO TYP. NO. 13\",$D70,IF($T70=\"TRANS. TYP. NO. 13 TO TYP. NO. 9\",$D70,0))","v":0},{"$f":"IF($T70=\"TRANS. TYP. NO. 10 TO TYP. NO. 13\",$D70,IF($T70=\"TRANS. TYP. NO. 13 TO TYP. NO. 10\",$D70,0))","v":0},{"$f":"IF($T70=\"TRANS. TYP. NO. 11 TO TYP. NO. 13\",$D70,IF($T70=\"TRANS. TYP. NO. 13 TO TYP. NO. 11\",$D70,0))","v":0},{"$f":"IF($T70=\"TRANS. TYP. NO. 12 TO TYP. NO. 13\",$D70,IF($T70=\"TRANS. TYP. NO. 13 TO TYP. NO. 12\",$D70,0))","v":0},{"$f":"IF(T70=\"TYP. NO. 14\",D70,0)","v":0},{"$f":"IF($T70=\"TRANS. TYP. NO. 1 TO TYP. NO. 14\",$D70,IF($T70=\"TRANS. TYP. NO. 14 TO TYP. NO. 1\",$D70,0))","v":0},{"$f":"IF($T70=\"TRANS. TYP. NO. 2 TO TYP. NO. 14\",$D70,IF($T70=\"TRANS. TYP. NO. 14 TO TYP. NO. 2\",$D70,0))","v":0},{"$f":"IF($T70=\"TRANS. TYP. NO. 3 TO TYP. NO. 14\",$D70,IF($T70=\"TRANS. TYP. NO. 14 TO TYP. NO. 3\",$D70,0))","v":0},{"$f":"IF($T70=\"TRANS. TYP. NO. 4 TO TYP. NO. 14\",$D70,IF($T70=\"TRANS. TYP. NO. 14 TO TYP. NO. 4\",$D70,0))","v":0},{"$f":"IF($T70=\"TRANS. TYP. NO. 5 TO TYP. NO. 14\",$D70,IF($T70=\"TRANS. TYP. NO. 14 TO TYP. NO. 5\",$D70,0))","v":0},{"$f":"IF($T70=\"TRANS. TYP. NO. 6 TO TYP. NO. 14\",$D70,IF($T70=\"TRANS. TYP. NO. 14 TO TYP. NO. 6\",$D70,0))","v":0},{"$f":"IF($T70=\"TRANS. TYP. NO. 7 TO TYP. NO. 14\",$D70,IF($T70=\"TRANS. TYP. NO. 14 TO TYP. NO. 7\",$D70,0))","v":0},{"$f":"IF($T70=\"TRANS. TYP. NO. 8 TO TYP. NO. 14\",$D70,IF($T70=\"TRANS. TYP. NO. 14 TO TYP. NO. 8\",$D70,0))","v":0},{"$f":"IF($T70=\"TRANS. TYP. NO. 9 TO TYP. NO. 14\",$D70,IF($T70=\"TRANS. TYP. NO. 14 TO TYP. NO. 9\",$D70,0))","v":0},{"$f":"IF($T70=\"TRANS. TYP. NO. 10 TO TYP. NO. 14\",$D70,IF($T70=\"TRANS. TYP. NO. 14 TO TYP. NO. 10\",$D70,0))","v":0},{"$f":"IF($T70=\"TRANS. TYP. NO. 11 TO TYP. NO. 14\",$D70,IF($T70=\"TRANS. TYP. NO. 14 TO TYP. NO. 11\",$D70,0))","v":0},{"$f":"IF($T70=\"TRANS. TYP. NO. 12 TO TYP. NO. 14\",$D70,IF($T70=\"TRANS. TYP. NO. 14 TO TYP. NO. 12\",$D70,0))","v":0},{"$f":"IF($T70=\"TRANS. TYP. NO. 13 TO TYP. NO. 14\",$D70,IF($T70=\"TRANS. TYP. NO. 14 TO TYP. NO. 13\",$D70,0))","v":0},{"$f":"IF(T70=\"TYP. NO. 15\",D70,0)","v":0},{"$f":"IF($T70=\"TRANS. TYP. NO. 1 TO TYP. NO. 15\",$D70,IF($T70=\"TRANS. TYP. NO. 15 TO TYP. NO. 1\",$D70,0))","v":0},{"$f":"IF($T70=\"TRANS. TYP. NO. 2 TO TYP. NO. 15\",$D70,IF($T70=\"TRANS. TYP. NO. 15 TO TYP. NO. 2\",$D70,0))","v":0},{"$f":"IF($T70=\"TRANS. TYP. NO. 3 TO TYP. NO. 15\",$D70,IF($T70=\"TRANS. TYP. NO. 15 TO TYP. NO. 3\",$D70,0))","v":0},{"$f":"IF($T70=\"TRANS. TYP. NO. 4 TO TYP. NO. 15\",$D70,IF($T70=\"TRANS. TYP. NO. 15 TO TYP. NO. 4\",$D70,0))","v":0},{"$f":"IF($T70=\"TRANS. TYP. NO. 5 TO TYP. NO. 15\",$D70,IF($T70=\"TRANS. TYP. NO. 15 TO TYP. NO. 5\",$D70,0))","v":0},{"$f":"IF($T70=\"TRANS. TYP. NO. 6 TO TYP. NO. 15\",$D70,IF($T70=\"TRANS. TYP. NO. 15 TO TYP. NO. 6\",$D70,0))","v":0},{"$f":"IF($T70=\"TRANS. TYP. NO. 7 TO TYP. NO. 15\",$D70,IF($T70=\"TRANS. TYP. NO. 15 TO TYP. NO. 7\",$D70,0))","v":0},{"$f":"IF($T70=\"TRANS. TYP. NO. 8 TO TYP. NO. 15\",$D70,IF($T70=\"TRANS. TYP. NO. 15 TO TYP. NO. 8\",$D70,0))","v":0},{"$f":"IF($T70=\"TRANS. TYP. NO. 9 TO TYP. NO. 15\",$D70,IF($T70=\"TRANS. TYP. NO. 15 TO TYP. NO. 9\",$D70,0))","v":0},{"$f":"IF($T70=\"TRANS. TYP. NO. 10 TO TYP. NO. 15\",$D70,IF($T70=\"TRANS. TYP. NO. 15 TO TYP. NO. 10\",$D70,0))","v":0},{"$f":"IF($T70=\"TRANS. TYP. NO. 11 TO TYP. NO. 15\",$D70,IF($T70=\"TRANS. TYP. NO. 15 TO TYP. NO. 11\",$D70,0))","v":0},{"$f":"IF($T70=\"TRANS. TYP. NO. 12 TO TYP. NO. 15\",$D70,IF($T70=\"TRANS. TYP. NO. 15 TO TYP. NO. 12\",$D70,0))","v":0},{"$f":"IF($T70=\"TRANS. TYP. NO. 13 TO TYP. NO. 15\",$D70,IF($T70=\"TRANS. TYP. NO. 15 TO TYP. NO. 13\",$D70,0))","v":0},{"$f":"IF($T70=\"TRANS. TYP. NO. 14 TO TYP. NO. 15\",$D70,IF($T70=\"TRANS. TYP. NO. 15 TO TYP. NO. 14\",$D70,0))","v":0},{"$f":"IF(T70=\"TYP. NO. 16\",D70,0)","v":0},{"$f":"IF($T70=\"TRANS. TYP. NO. 1 TO TYP. NO. 16\",$D70,IF($T70=\"TRANS. TYP. NO. 16 TO TYP. NO. 1\",$D70,0))","v":0},{"$f":"IF($T70=\"TRANS. TYP. NO. 2 TO TYP. NO. 16\",$D70,IF($T70=\"TRANS. TYP. NO. 16 TO TYP. NO. 2\",$D70,0))","v":0},{"$f":"IF($T70=\"TRANS. TYP. NO. 3 TO TYP. NO. 16\",$D70,IF($T70=\"TRANS. TYP. NO. 16 TO TYP. NO. 3\",$D70,0))","v":0},{"$f":"IF($T70=\"TRANS. TYP. NO. 4 TO TYP. NO. 16\",$D70,IF($T70=\"TRANS. TYP. NO. 16 TO TYP. NO. 4\",$D70,0))","v":0},{"$f":"IF($T70=\"TRANS. TYP. NO. 5 TO TYP. NO. 16\",$D70,IF($T70=\"TRANS. TYP. NO. 16 TO TYP. NO. 5\",$D70,0))","v":0},{"$f":"IF($T70=\"TRANS. TYP. NO. 6 TO TYP. NO. 16\",$D70,IF($T70=\"TRANS. TYP. NO. 16 TO TYP. NO. 6\",$D70,0))","v":0},{"$f":"IF($T70=\"TRANS. TYP. NO. 7 TO TYP. NO. 16\",$D70,IF($T70=\"TRANS. TYP. NO. 16 TO TYP. NO. 7\",$D70,0))","v":0},{"$f":"IF($T70=\"TRANS. TYP. NO. 8 TO TYP. NO. 16\",$D70,IF($T70=\"TRANS. TYP. NO. 16 TO TYP. NO. 8\",$D70,0))","v":0},{"$f":"IF($T70=\"TRANS. TYP. NO. 9 TO TYP. NO. 16\",$D70,IF($T70=\"TRANS. TYP. NO. 16 TO TYP. NO. 9\",$D70,0))","v":0},{"$f":"IF($T70=\"TRANS. TYP. NO. 10 TO TYP. NO. 16\",$D70,IF($T70=\"TRANS. TYP. NO. 16 TO TYP. NO. 10\",$D70,0))","v":0},{"$f":"IF($T70=\"TRANS. TYP. NO. 11 TO TYP. NO. 16\",$D70,IF($T70=\"TRANS. TYP. NO. 16 TO TYP. NO. 11\",$D70,0))","v":0},{"$f":"IF($T70=\"TRANS. TYP. NO. 12 TO TYP. NO. 16\",$D70,IF($T70=\"TRANS. TYP. NO. 16 TO TYP. NO. 12\",$D70,0))","v":0},{"$f":"IF($T70=\"TRANS. TYP. NO. 13 TO TYP. NO. 16\",$D70,IF($T70=\"TRANS. TYP. NO. 16 TO TYP. NO. 13\",$D70,0))","v":0},{"$f":"IF($T70=\"TRANS. TYP. NO. 14 TO TYP. NO. 16\",$D70,IF($T70=\"TRANS. TYP. NO. 16 TO TYP. NO. 14\",$D70,0))","v":0},{"$f":"IF($T70=\"TRANS. TYP. NO. 15 TO TYP. NO. 16\",$D70,IF($T70=\"TRANS. TYP. NO. 16 TO TYP. NO. 15\",$D70,0))","v":0}]
[null,null,"","",null,null,null,null,{"$f":"IF(OR($G71=\"BRIDGE\",$G72=\"BRIDGE\"),\"\",IF(AND($D71=\"\",$A71>0,$B71>0),\"~\",IF(W71=\"ERROR\",\"\",IF(W71=0,\"\",ROUND(W71*$D71/100,0)))))","v":""},{"$f":"IF(OR($G71=\"BRIDGE\",$G72=\"BRIDGE\"),\"\",IF(AND($D71=\"\",$A71>0,$B71>0),\"~\",IF(X71=\"ERROR\",\"\",IF(X71=0,\"\",ROUND(X71*$D71/100,0)))))","v":""},{"$f":"IF(OR($G71=\"BRIDGE\",$G72=\"BRIDGE\"),\"\",IF(AND($D71=\"\",$A71>0,$B71>0),\"~\",IF(Y71=\"ERROR\",\"\",IF(Y71=0,\"\",ROUND(Y71*$D71/100,0)))))","v":""},{"$f":"IF(OR($G71=\"BRIDGE\",$G72=\"BRIDGE\"),\"\",IF(AND($D71=\"\",$A71>0,$B71>0),\"~\",IF(Z71=\"ERROR\",\"\",IF(Z71=0,\"\",ROUND(Z71*$D71/100,0)))))","v":""},{"$f":"IF(OR($G71=\"BRIDGE\",$G72=\"BRIDGE\"),\"\",IF(AND($D71=\"\",$A71>0,$B71>0),\"~\",IF(AA71=\"ERROR\",\"\",IF(AA71=0,\"\",ROUND(AA71*$D71/100,0)))))","v":""},{"$f":"IF(OR($G71=\"BRIDGE\",$G72=\"BRIDGE\"),\"\",IF(AND($D71=\"\",$A71>0,$B71>0),\"~\",IF(AB71=\"ERROR\",\"\",IF(AB71=0,\"\",ROUND(AB71*$D71/100,0)))))","v":""},{"$f":"IF(OR($G71=\"BRIDGE\",$G72=\"BRIDGE\"),\"\",IF(AND($D71=\"\",$A71>0,$B71>0),\"~\",IF(AC71=\"ERROR\",\"\",IF(AC71=0,\"\",ROUND(AC71*$D71/100,1)))))","v":""},{"$f":"IF(OR($G71=\"BRIDGE\",$G72=\"BRIDGE\"),\"\",IF(AND($D71=\"\",$A71>0,$B71>0),\"~\",IF(AD71=\"ERROR\",\"\",IF(AD71=0,\"\",ROUND(AD71*$D71/100,1)))))","v":""},{"$f":"IF(OR($G71=\"BRIDGE\",$G72=\"BRIDGE\"),\"\",IF(AND($D71=\"\",$A71>0,$B71>0),\"~\",IF(AE71=\"ERROR\",\"\",IF(AE71=0,\"\",ROUND(AE71*$D71/100,0)))))","v":""},{"$f":"IF(OR($G71=\"BRIDGE\",$G72=\"BRIDGE\"),\"\",IF(AND($D71=\"\",$A71>0,$B71>0),\"~\",IF(AF71=\"ERROR\",\"\",IF(AF71=0,\"\",ROUND(AF71*$D71/100,0)))))","v":""},{"$f":"IF(OR($G71=\"BRIDGE\",$G72=\"BRIDGE\"),\"\",IF(AND($D71=\"\",$A71>0,$B71>0),\"~\",IF(AG71=\"ERROR\",\"\",IF(AG71=0,\"\",ROUND(AG71*$D71/100,0)))))","v":""},null,null,{"$f":"IF(T71=\"\",402,MATCH(T71,'Lookup Values'!$B$1:$B$402,0))","v":402},{"$f":"LOOKUP($V71,'Lookup Values'!$A$2:$A$402,'Lookup Values'!C$2:C$402)","v":"ERROR"},{"$f":"LOOKUP($V71,'Lookup Values'!$A$2:$A$402,'Lookup Values'!D$2:D$402)","v":"ERROR"},{"$f":"LOOKUP($V71,'Lookup Values'!$A$2:$A$402,'Lookup Values'!E$2:E$402)","v":"ERROR"},{"$f":"LOOKUP($V71,'Lookup Values'!$A$2:$A$402,'Lookup Values'!F$2:F$402)","v":"ERROR"},{"$f":"LOOKUP($V71,'Lookup Values'!$A$2:$A$402,'Lookup Values'!G$2:G$402)","v":"ERROR"},{"$f":"LOOKUP($V71,'Lookup Values'!$A$2:$A$402,'Lookup Values'!H$2:H$402)","v":"ERROR"},{"$f":"LOOKUP($V71,'Lookup Values'!$A$2:$A$402,'Lookup Values'!I$2:I$402)","v":"ERROR"},{"$f":"LOOKUP($V71,'Lookup Values'!$A$2:$A$402,'Lookup Values'!J$2:J$402)","v":"ERROR"},{"$f":"LOOKUP($V71,'Lookup Values'!$A$2:$A$402,'Lookup Values'!K$2:K$402)","v":"ERROR"},{"$f":"LOOKUP($V71,'Lookup Values'!$A$2:$A$402,'Lookup Values'!L$2:L$402)","v":"ERROR"},{"$f":"LOOKUP($V71,'Lookup Values'!$A$2:$A$402,'Lookup Values'!M$2:M$402)","v":"ERROR"},null,0,0,0,0,0,0,0,0,0,0,0,0,0,0,0,0,0,0,0,0,0,0,0,0,0,0,0,0,0,0,0,0,0,0,0,0,0,0,0,0,0,0,0,0,0,0,0,0,0,0,0,0,0,0,0,0,0,0,0,0,0,0,0,0,0,0,0,0,0,0,0,0,0,0,0,0,0,0,0,0,0,0,0,0,0,0,0,0,0,0,0,0,0,0,0,0,0,0,0,0,0,0,0,0,0,0,0,0,0,0,0,0,0,0,0,0,0,0,0,0,0,0,0,0,0,0,0,0,0,0,0,0,0,0,0,0]
[null,null,"","",null,null,null,null,"","","","","","","","","","","",null,null,{"$f":"IF(T72=\"\",402,MATCH(T72,'Lookup Values'!$B$1:$B$402,0))","v":402},{"$f":"LOOKUP($V72,'Lookup Values'!$A$2:$A$402,'Lookup Values'!C$2:C$402)","v":"ERROR"},{"$f":"LOOKUP($V72,'Lookup Values'!$A$2:$A$402,'Lookup Values'!D$2:D$402)","v":"ERROR"},{"$f":"LOOKUP($V72,'Lookup Values'!$A$2:$A$402,'Lookup Values'!E$2:E$402)","v":"ERROR"},{"$f":"LOOKUP($V72,'Lookup Values'!$A$2:$A$402,'Lookup Values'!F$2:F$402)","v":"ERROR"},{"$f":"LOOKUP($V72,'Lookup Values'!$A$2:$A$402,'Lookup Values'!G$2:G$402)","v":"ERROR"},{"$f":"LOOKUP($V72,'Lookup Values'!$A$2:$A$402,'Lookup Values'!H$2:H$402)","v":"ERROR"},{"$f":"LOOKUP($V72,'Lookup Values'!$A$2:$A$402,'Lookup Values'!I$2:I$402)","v":"ERROR"},{"$f":"LOOKUP($V72,'Lookup Values'!$A$2:$A$402,'Lookup Values'!J$2:J$402)","v":"ERROR"},{"$f":"LOOKUP($V72,'Lookup Values'!$A$2:$A$402,'Lookup Values'!K$2:K$402)","v":"ERROR"},{"$f":"LOOKUP($V72,'Lookup Values'!$A$2:$A$402,'Lookup Values'!L$2:L$402)","v":"ERROR"},{"$f":"LOOKUP($V72,'Lookup Values'!$A$2:$A$402,'Lookup Values'!M$2:M$402)","v":"ERROR"},null,0,0,0,0,0,0,0,0,0,0,0,0,0,0,0,0,0,0,0,0,0,0,0,0,0,0,0,0,0,0,0,0,0,0,0,0,0,0,0,0,0,0,0,0,0,0,0,0,0,0,0,0,0,0,0,0,0,0,0,0,0,0,0,0,0,0,0,0,0,0,0,0,0,0,0,0,0,0,0,0,0,0,0,0,0,0,0,0,0,0,0,0,0,0,0,0,0,0,0,0,0,0,0,0,0,0,0,0,0,0,0,0,0,0,0,0,0,0,0,0,0,0,0,0,0,0,0,0,0,0,0,0,0,0,0,0]
[null,null,"","",null,null,null,null,"","","","","","","","","","","",null,null,{"$f":"IF(T73=\"\",402,MATCH(T73,'Lookup Values'!$B$1:$B$402,0))","v":402},{"$f":"LOOKUP($V73,'Lookup Values'!$A$2:$A$402,'Lookup Values'!C$2:C$402)","v":"ERROR"},{"$f":"LOOKUP($V73,'Lookup Values'!$A$2:$A$402,'Lookup Values'!D$2:D$402)","v":"ERROR"},{"$f":"LOOKUP($V73,'Lookup Values'!$A$2:$A$402,'Lookup Values'!E$2:E$402)","v":"ERROR"},{"$f":"LOOKUP($V73,'Lookup Values'!$A$2:$A$402,'Lookup Values'!F$2:F$402)","v":"ERROR"},{"$f":"LOOKUP($V73,'Lookup Values'!$A$2:$A$402,'Lookup Values'!G$2:G$402)","v":"ERROR"},{"$f":"LOOKUP($V73,'Lookup Values'!$A$2:$A$402,'Lookup Values'!H$2:H$402)","v":"ERROR"},{"$f":"LOOKUP($V73,'Lookup Values'!$A$2:$A$402,'Lookup Values'!I$2:I$402)","v":"ERROR"},{"$f":"LOOKUP($V73,'Lookup Values'!$A$2:$A$402,'Lookup Values'!J$2:J$402)","v":"ERROR"},{"$f":"LOOKUP($V73,'Lookup Values'!$A$2:$A$402,'Lookup Values'!K$2:K$402)","v":"ERROR"},{"$f":"LOOKUP($V73,'Lookup Values'!$A$2:$A$402,'Lookup Values'!L$2:L$402)","v":"ERROR"},{"$f":"LOOKUP($V73,'Lookup Values'!$A$2:$A$402,'Lookup Values'!M$2:M$402)","v":"ERROR"},null,0,0,0,0,0,0,0,0,0,0,0,0,0,0,0,0,0,0,0,0,0,0,0,0,0,0,0,0,0,0,0,0,0,0,0,0,0,0,0,0,0,0,0,0,0,0,0,0,0,0,0,0,0,0,0,0,0,0,0,0,0,0,0,0,0,0,0,0,0,0,0,0,0,0,0,0,0,0,0,0,0,0,0,0,0,0,0,0,0,0,0,0,0,0,0,0,0,0,0,0,0,0,0,0,0,0,0,0,0,0,0,0,0,0,0,0,0,0,0,0,0,0,0,0,0,0,0,0,0,0,0,0,0,0,0,0]
[null,null,"","",null,null,null,null,"","","","","","","","","","","",null,null,{"$f":"IF(T74=\"\",402,MATCH(T74,'Lookup Values'!$B$1:$B$402,0))","v":402},{"$f":"LOOKUP($V74,'Lookup Values'!$A$2:$A$402,'Lookup Values'!C$2:C$402)","v":"ERROR"},{"$f":"LOOKUP($V74,'Lookup Values'!$A$2:$A$402,'Lookup Values'!D$2:D$402)","v":"ERROR"},{"$f":"LOOKUP($V74,'Lookup Values'!$A$2:$A$402,'Lookup Values'!E$2:E$402)","v":"ERROR"},{"$f":"LOOKUP($V74,'Lookup Values'!$A$2:$A$402,'Lookup Values'!F$2:F$402)","v":"ERROR"},{"$f":"LOOKUP($V74,'Lookup Values'!$A$2:$A$402,'Lookup Values'!G$2:G$402)","v":"ERROR"},{"$f":"LOOKUP($V74,'Lookup Values'!$A$2:$A$402,'Lookup Values'!H$2:H$402)","v":"ERROR"},{"$f":"LOOKUP($V74,'Lookup Values'!$A$2:$A$402,'Lookup Values'!I$2:I$402)","v":"ERROR"},{"$f":"LOOKUP($V74,'Lookup Values'!$A$2:$A$402,'Lookup Values'!J$2:J$402)","v":"ERROR"},{"$f":"LOOKUP($V74,'Lookup Values'!$A$2:$A$402,'Lookup Values'!K$2:K$402)","v":"ERROR"},{"$f":"LOOKUP($V74,'Lookup Values'!$A$2:$A$402,'Lookup Values'!L$2:L$402)","v":"ERROR"},{"$f":"LOOKUP($V74,'Lookup Values'!$A$2:$A$402,'Lookup Values'!M$2:M$402)","v":"ERROR"},null,0,0,0,0,0,0,0,0,0,0,0,0,0,0,0,0,0,0,0,0,0,0,0,0,0,0,0,0,0,0,0,0,0,0,0,0,0,0,0,0,0,0,0,0,0,0,0,0,0,0,0,0,0,0,0,0,0,0,0,0,0,0,0,0,0,0,0,0,0,0,0,0,0,0,0,0,0,0,0,0,0,0,0,0,0,0,0,0,0,0,0,0,0,0,0,0,0,0,0,0,0,0,0,0,0,0,0,0,0,0,0,0,0,0,0,0,0,0,0,0,0,0,0,0,0,0,0,0,0,0,0,0,0,0,0,0]
[null,null,"","",null,null,null,null,"","","","","","","","","","","",null,null,{"$f":"IF(T75=\"\",402,MATCH(T75,'Lookup Values'!$B$1:$B$402,0))","v":402},{"$f":"LOOKUP($V75,'Lookup Values'!$A$2:$A$402,'Lookup Values'!C$2:C$402)","v":"ERROR"},{"$f":"LOOKUP($V75,'Lookup Values'!$A$2:$A$402,'Lookup Values'!D$2:D$402)","v":"ERROR"},{"$f":"LOOKUP($V75,'Lookup Values'!$A$2:$A$402,'Lookup Values'!E$2:E$402)","v":"ERROR"},{"$f":"LOOKUP($V75,'Lookup Values'!$A$2:$A$402,'Lookup Values'!F$2:F$402)","v":"ERROR"},{"$f":"LOOKUP($V75,'Lookup Values'!$A$2:$A$402,'Lookup Values'!G$2:G$402)","v":"ERROR"},{"$f":"LOOKUP($V75,'Lookup Values'!$A$2:$A$402,'Lookup Values'!H$2:H$402)","v":"ERROR"},{"$f":"LOOKUP($V75,'Lookup Values'!$A$2:$A$402,'Lookup Values'!I$2:I$402)","v":"ERROR"},{"$f":"LOOKUP($V75,'Lookup Values'!$A$2:$A$402,'Lookup Values'!J$2:J$402)","v":"ERROR"},{"$f":"LOOKUP($V75,'Lookup Values'!$A$2:$A$402,'Lookup Values'!K$2:K$402)","v":"ERROR"},{"$f":"LOOKUP($V75,'Lookup Values'!$A$2:$A$402,'Lookup Values'!L$2:L$402)","v":"ERROR"},{"$f":"LOOKUP($V75,'Lookup Values'!$A$2:$A$402,'Lookup Values'!M$2:M$402)","v":"ERROR"},null,0,0,0,0,0,0,0,0,0,0,0,0,0,0,0,0,0,0,0,0,0,0,0,0,0,0,0,0,0,0,0,0,0,0,0,0,0,0,0,0,0,0,0,0,0,0,0,0,0,0,0,0,0,0,0,0,0,0,0,0,0,0,0,0,0,0,0,0,0,0,0,0,0,0,0,0,0,0,0,0,0,0,0,0,0,0,0,0,0,0,0,0,0,0,0,0,0,0,0,0,0,0,0,0,0,0,0,0,0,0,0,0,0,0,0,0,0,0,0,0,0,0,0,0,0,0,0,0,0,0,0,0,0,0,0,0]
[null,null,"","",null,null,null,null,"","","","","","","","","","","",null,null,{"$f":"IF(T76=\"\",402,MATCH(T76,'Lookup Values'!$B$1:$B$402,0))","v":402},{"$f":"LOOKUP($V76,'Lookup Values'!$A$2:$A$402,'Lookup Values'!C$2:C$402)","v":"ERROR"},{"$f":"LOOKUP($V76,'Lookup Values'!$A$2:$A$402,'Lookup Values'!D$2:D$402)","v":"ERROR"},{"$f":"LOOKUP($V76,'Lookup Values'!$A$2:$A$402,'Lookup Values'!E$2:E$402)","v":"ERROR"},{"$f":"LOOKUP($V76,'Lookup Values'!$A$2:$A$402,'Lookup Values'!F$2:F$402)","v":"ERROR"},{"$f":"LOOKUP($V76,'Lookup Values'!$A$2:$A$402,'Lookup Values'!G$2:G$402)","v":"ERROR"},{"$f":"LOOKUP($V76,'Lookup Values'!$A$2:$A$402,'Lookup Values'!H$2:H$402)","v":"ERROR"},{"$f":"LOOKUP($V76,'Lookup Values'!$A$2:$A$402,'Lookup Values'!I$2:I$402)","v":"ERROR"},{"$f":"LOOKUP($V76,'Lookup Values'!$A$2:$A$402,'Lookup Values'!J$2:J$402)","v":"ERROR"},{"$f":"LOOKUP($V76,'Lookup Values'!$A$2:$A$402,'Lookup Values'!K$2:K$402)","v":"ERROR"},{"$f":"LOOKUP($V76,'Lookup Values'!$A$2:$A$402,'Lookup Values'!L$2:L$402)","v":"ERROR"},{"$f":"LOOKUP($V76,'Lookup Values'!$A$2:$A$402,'Lookup Values'!M$2:M$402)","v":"ERROR"},null,0,0,0,0,0,0,0,0,0,0,0,0,0,0,0,0,0,0,0,0,0,0,0,0,0,0,0,0,0,0,0,0,0,0,0,0,0,0,0,0,0,0,0,0,0,0,0,0,0,0,0,0,0,0,0,0,0,0,0,0,0,0,0,0,0,0,0,0,0,0,0,0,0,0,0,0,0,0,0,0,0,0,0,0,0,0,0,0,0,0,0,0,0,0,0,0,0,0,0,0,0,0,0,0,0,0,0,0,0,0,0,0,0,0,0,0,0,0,0,0,0,0,0,0,0,0,0,0,0,0,0,0,0,0,0,0]
[null,null,"","",null,null,null,null,"","","","","","","","","","","",null,null,{"$f":"IF(T77=\"\",402,MATCH(T77,'Lookup Values'!$B$1:$B$402,0))","v":402},{"$f":"LOOKUP($V77,'Lookup Values'!$A$2:$A$402,'Lookup Values'!C$2:C$402)","v":"ERROR"},{"$f":"LOOKUP($V77,'Lookup Values'!$A$2:$A$402,'Lookup Values'!D$2:D$402)","v":"ERROR"},{"$f":"LOOKUP($V77,'Lookup Values'!$A$2:$A$402,'Lookup Values'!E$2:E$402)","v":"ERROR"},{"$f":"LOOKUP($V77,'Lookup Values'!$A$2:$A$402,'Lookup Values'!F$2:F$402)","v":"ERROR"},{"$f":"LOOKUP($V77,'Lookup Values'!$A$2:$A$402,'Lookup Values'!G$2:G$402)","v":"ERROR"},{"$f":"LOOKUP($V77,'Lookup Values'!$A$2:$A$402,'Lookup Values'!H$2:H$402)","v":"ERROR"},{"$f":"LOOKUP($V77,'Lookup Values'!$A$2:$A$402,'Lookup Values'!I$2:I$402)","v":"ERROR"},{"$f":"LOOKUP($V77,'Lookup Values'!$A$2:$A$402,'Lookup Values'!J$2:J$402)","v":"ERROR"},{"$f":"LOOKUP($V77,'Lookup Values'!$A$2:$A$402,'Lookup Values'!K$2:K$402)","v":"ERROR"},{"$f":"LOOKUP($V77,'Lookup Values'!$A$2:$A$402,'Lookup Values'!L$2:L$402)","v":"ERROR"},{"$f":"LOOKUP($V77,'Lookup Values'!$A$2:$A$402,'Lookup Values'!M$2:M$402)","v":"ERROR"},null,0,0,0,0,0,0,0,0,0,0,0,0,0,0,0,0,0,0,0,0,0,0,0,0,0,0,0,0,0,0,0,0,0,0,0,0,0,0,0,0,0,0,0,0,0,0,0,0,0,0,0,0,0,0,0,0,0,0,0,0,0,0,0,0,0,0,0,0,0,0,0,0,0,0,0,0,0,0,0,0,0,0,0,0,0,0,0,0,0,0,0,0,0,0,0,0,0,0,0,0,0,0,0,0,0,0,0,0,0,0,0,0,0,0,0,0,0,0,0,0,0,0,0,0,0,0,0,0,0,0,0,0,0,0,0,0]
[null,null,"","",null,null,null,null,"","","","","","","","","","","",null,null,{"$f":"IF(T78=\"\",402,MATCH(T78,'Lookup Values'!$B$1:$B$402,0))","v":402},{"$f":"LOOKUP($V78,'Lookup Values'!$A$2:$A$402,'Lookup Values'!C$2:C$402)","v":"ERROR"},{"$f":"LOOKUP($V78,'Lookup Values'!$A$2:$A$402,'Lookup Values'!D$2:D$402)","v":"ERROR"},{"$f":"LOOKUP($V78,'Lookup Values'!$A$2:$A$402,'Lookup Values'!E$2:E$402)","v":"ERROR"},{"$f":"LOOKUP($V78,'Lookup Values'!$A$2:$A$402,'Lookup Values'!F$2:F$402)","v":"ERROR"},{"$f":"LOOKUP($V78,'Lookup Values'!$A$2:$A$402,'Lookup Values'!G$2:G$402)","v":"ERROR"},{"$f":"LOOKUP($V78,'Lookup Values'!$A$2:$A$402,'Lookup Values'!H$2:H$402)","v":"ERROR"},{"$f":"LOOKUP($V78,'Lookup Values'!$A$2:$A$402,'Lookup Values'!I$2:I$402)","v":"ERROR"},{"$f":"LOOKUP($V78,'Lookup Values'!$A$2:$A$402,'Lookup Values'!J$2:J$402)","v":"ERROR"},{"$f":"LOOKUP($V78,'Lookup Values'!$A$2:$A$402,'Lookup Values'!K$2:K$402)","v":"ERROR"},{"$f":"LOOKUP($V78,'Lookup Values'!$A$2:$A$402,'Lookup Values'!L$2:L$402)","v":"ERROR"},{"$f":"LOOKUP($V78,'Lookup Values'!$A$2:$A$402,'Lookup Values'!M$2:M$402)","v":"ERROR"},null,0,0,0,0,0,0,0,0,0,0,0,0,0,0,0,0,0,0,0,0,0,0,0,0,0,0,0,0,0,0,0,0,0,0,0,0,0,0,0,0,0,0,0,0,0,0,0,0,0,0,0,0,0,0,0,0,0,0,0,0,0,0,0,0,0,0,0,0,0,0,0,0,0,0,0,0,0,0,0,0,0,0,0,0,0,0,0,0,0,0,0,0,0,0,0,0,0,0,0,0,0,0,0,0,0,0,0,0,0,0,0,0,0,0,0,0,0,0,0,0,0,0,0,0,0,0,0,0,0,0,0,0,0,0,0,0]
[null,null,"","",null,null,null,null,"","","","","","","","","","","",null,null,{"$f":"IF(T79=\"\",402,MATCH(T79,'Lookup Values'!$B$1:$B$402,0))","v":402},{"$f":"LOOKUP($V79,'Lookup Values'!$A$2:$A$402,'Lookup Values'!C$2:C$402)","v":"ERROR"},{"$f":"LOOKUP($V79,'Lookup Values'!$A$2:$A$402,'Lookup Values'!D$2:D$402)","v":"ERROR"},{"$f":"LOOKUP($V79,'Lookup Values'!$A$2:$A$402,'Lookup Values'!E$2:E$402)","v":"ERROR"},{"$f":"LOOKUP($V79,'Lookup Values'!$A$2:$A$402,'Lookup Values'!F$2:F$402)","v":"ERROR"},{"$f":"LOOKUP($V79,'Lookup Values'!$A$2:$A$402,'Lookup Values'!G$2:G$402)","v":"ERROR"},{"$f":"LOOKUP($V79,'Lookup Values'!$A$2:$A$402,'Lookup Values'!H$2:H$402)","v":"ERROR"},{"$f":"LOOKUP($V79,'Lookup Values'!$A$2:$A$402,'Lookup Values'!I$2:I$402)","v":"ERROR"},{"$f":"LOOKUP($V79,'Lookup Values'!$A$2:$A$402,'Lookup Values'!J$2:J$402)","v":"ERROR"},{"$f":"LOOKUP($V79,'Lookup Values'!$A$2:$A$402,'Lookup Values'!K$2:K$402)","v":"ERROR"},{"$f":"LOOKUP($V79,'Lookup Values'!$A$2:$A$402,'Lookup Values'!L$2:L$402)","v":"ERROR"},{"$f":"LOOKUP($V79,'Lookup Values'!$A$2:$A$402,'Lookup Values'!M$2:M$402)","v":"ERROR"},null,0,0,0,0,0,0,0,0,0,0,0,0,0,0,0,0,0,0,0,0,0,0,0,0,0,0,0,0,0,0,0,0,0,0,0,0,0,0,0,0,0,0,0,0,0,0,0,0,0,0,0,0,0,0,0,0,0,0,0,0,0,0,0,0,0,0,0,0,0,0,0,0,0,0,0,0,0,0,0,0,0,0,0,0,0,0,0,0,0,0,0,0,0,0,0,0,0,0,0,0,0,0,0,0,0,0,0,0,0,0,0,0,0,0,0,0,0,0,0,0,0,0,0,0,0,0,0,0,0,0,0,0,0,0,0,0]
[null,null,"","",null,null,null,null,"","","","","","","","","","","",null,null,{"$f":"IF(T80=\"\",402,MATCH(T80,'Lookup Values'!$B$1:$B$402,0))","v":402},{"$f":"LOOKUP($V80,'Lookup Values'!$A$2:$A$402,'Lookup Values'!C$2:C$402)","v":"ERROR"},{"$f":"LOOKUP($V80,'Lookup Values'!$A$2:$A$402,'Lookup Values'!D$2:D$402)","v":"ERROR"},{"$f":"LOOKUP($V80,'Lookup Values'!$A$2:$A$402,'Lookup Values'!E$2:E$402)","v":"ERROR"},{"$f":"LOOKUP($V80,'Lookup Values'!$A$2:$A$402,'Lookup Values'!F$2:F$402)","v":"ERROR"},{"$f":"LOOKUP($V80,'Lookup Values'!$A$2:$A$402,'Lookup Values'!G$2:G$402)","v":"ERROR"},{"$f":"LOOKUP($V80,'Lookup Values'!$A$2:$A$402,'Lookup Values'!H$2:H$402)","v":"ERROR"},{"$f":"LOOKUP($V80,'Lookup Values'!$A$2:$A$402,'Lookup Values'!I$2:I$402)","v":"ERROR"},{"$f":"LOOKUP($V80,'Lookup Values'!$A$2:$A$402,'Lookup Values'!J$2:J$402)","v":"ERROR"},{"$f":"LOOKUP($V80,'Lookup Values'!$A$2:$A$402,'Lookup Values'!K$2:K$402)","v":"ERROR"},{"$f":"LOOKUP($V80,'Lookup Values'!$A$2:$A$402,'Lookup Values'!L$2:L$402)","v":"ERROR"},{"$f":"LOOKUP($V80,'Lookup Values'!$A$2:$A$402,'Lookup Values'!M$2:M$402)","v":"ERROR"},null,0,0,0,0,0,0,0,0,0,0,0,0,0,0,0,0,0,0,0,0,0,0,0,0,0,0,0,0,0,0,0,0,0,0,0,0,0,0,0,0,0,0,0,0,0,0,0,0,0,0,0,0,0,0,0,0,0,0,0,0,0,0,0,0,0,0,0,0,0,0,0,0,0,0,0,0,0,0,0,0,0,0,0,0,0,0,0,0,0,0,0,0,0,0,0,0,0,0,0,0,0,0,0,0,0,0,0,0,0,0,0,0,0,0,0,0,0,0,0,0,0,0,0,0,0,0,0,0,0,0,0,0,0,0,0,0]
[null,null,"","",null,null,null,null,"","","","","","","","","","","",null,null,{"$f":"IF(T81=\"\",402,MATCH(T81,'Lookup Values'!$B$1:$B$402,0))","v":402},{"$f":"LOOKUP($V81,'Lookup Values'!$A$2:$A$402,'Lookup Values'!C$2:C$402)","v":"ERROR"},{"$f":"LOOKUP($V81,'Lookup Values'!$A$2:$A$402,'Lookup Values'!D$2:D$402)","v":"ERROR"},{"$f":"LOOKUP($V81,'Lookup Values'!$A$2:$A$402,'Lookup Values'!E$2:E$402)","v":"ERROR"},{"$f":"LOOKUP($V81,'Lookup Values'!$A$2:$A$402,'Lookup Values'!F$2:F$402)","v":"ERROR"},{"$f":"LOOKUP($V81,'Lookup Values'!$A$2:$A$402,'Lookup Values'!G$2:G$402)","v":"ERROR"},{"$f":"LOOKUP($V81,'Lookup Values'!$A$2:$A$402,'Lookup Values'!H$2:H$402)","v":"ERROR"},{"$f":"LOOKUP($V81,'Lookup Values'!$A$2:$A$402,'Lookup Values'!I$2:I$402)","v":"ERROR"},{"$f":"LOOKUP($V81,'Lookup Values'!$A$2:$A$402,'Lookup Values'!J$2:J$402)","v":"ERROR"},{"$f":"LOOKUP($V81,'Lookup Values'!$A$2:$A$402,'Lookup Values'!K$2:K$402)","v":"ERROR"},{"$f":"LOOKUP($V81,'Lookup Values'!$A$2:$A$402,'Lookup Values'!L$2:L$402)","v":"ERROR"},{"$f":"LOOKUP($V81,'Lookup Values'!$A$2:$A$402,'Lookup Values'!M$2:M$402)","v":"ERROR"},null,0,0,0,0,0,0,0,0,0,0,0,0,0,0,0,0,0,0,0,0,0,0,0,0,0,0,0,0,0,0,0,0,0,0,0,0,0,0,0,0,0,0,0,0,0,0,0,0,0,0,0,0,0,0,0,0,0,0,0,0,0,0,0,0,0,0,0,0,0,0,0,0,0,0,0,0,0,0,0,0,0,0,0,0,0,0,0,0,0,0,0,0,0,0,0,0,0,0,0,0,0,0,0,0,0,0,0,0,0,0,0,0,0,0,0,0,0,0,0,0,0,0,0,0,0,0,0,0,0,0,0,0,0,0,0,0]
[null,null,"","",null,null,null,null,"","","","","","","","","","","",null,null,{"$f":"IF(T82=\"\",402,MATCH(T82,'Lookup Values'!$B$1:$B$402,0))","v":402},{"$f":"LOOKUP($V82,'Lookup Values'!$A$2:$A$402,'Lookup Values'!C$2:C$402)","v":"ERROR"},{"$f":"LOOKUP($V82,'Lookup Values'!$A$2:$A$402,'Lookup Values'!D$2:D$402)","v":"ERROR"},{"$f":"LOOKUP($V82,'Lookup Values'!$A$2:$A$402,'Lookup Values'!E$2:E$402)","v":"ERROR"},{"$f":"LOOKUP($V82,'Lookup Values'!$A$2:$A$402,'Lookup Values'!F$2:F$402)","v":"ERROR"},{"$f":"LOOKUP($V82,'Lookup Values'!$A$2:$A$402,'Lookup Values'!G$2:G$402)","v":"ERROR"},{"$f":"LOOKUP($V82,'Lookup Values'!$A$2:$A$402,'Lookup Values'!H$2:H$402)","v":"ERROR"},{"$f":"LOOKUP($V82,'Lookup Values'!$A$2:$A$402,'Lookup Values'!I$2:I$402)","v":"ERROR"},{"$f":"LOOKUP($V82,'Lookup Values'!$A$2:$A$402,'Lookup Values'!J$2:J$402)","v":"ERROR"},{"$f":"LOOKUP($V82,'Lookup Values'!$A$2:$A$402,'Lookup Values'!K$2:K$402)","v":"ERROR"},{"$f":"LOOKUP($V82,'Lookup Values'!$A$2:$A$402,'Lookup Values'!L$2:L$402)","v":"ERROR"},{"$f":"LOOKUP($V82,'Lookup Values'!$A$2:$A$402,'Lookup Values'!M$2:M$402)","v":"ERROR"},null,0,0,0,0,0,0,0,0,0,0,0,0,0,0,0,0,0,0,0,0,0,0,0,0,0,0,0,0,0,0,0,0,0,0,0,0,0,0,0,0,0,0,0,0,0,0,0,0,0,0,0,0,0,0,0,0,0,0,0,0,0,0,0,0,0,0,0,0,0,0,0,0,0,0,0,0,0,0,0,0,0,0,0,0,0,0,0,0,0,0,0,0,0,0,0,0,0,0,0,0,0,0,0,0,0,0,0,0,0,0,0,0,0,0,0,0,0,0,0,0,0,0,0,0,0,0,0,0,0,0,0,0,0,0,0,0]
[null,null,"","",null,null,null,null,"","","","","","","","","","","",null,null,{"$f":"IF(T83=\"\",402,MATCH(T83,'Lookup Values'!$B$1:$B$402,0))","v":402},{"$f":"LOOKUP($V83,'Lookup Values'!$A$2:$A$402,'Lookup Values'!C$2:C$402)","v":"ERROR"},{"$f":"LOOKUP($V83,'Lookup Values'!$A$2:$A$402,'Lookup Values'!D$2:D$402)","v":"ERROR"},{"$f":"LOOKUP($V83,'Lookup Values'!$A$2:$A$402,'Lookup Values'!E$2:E$402)","v":"ERROR"},{"$f":"LOOKUP($V83,'Lookup Values'!$A$2:$A$402,'Lookup Values'!F$2:F$402)","v":"ERROR"},{"$f":"LOOKUP($V83,'Lookup Values'!$A$2:$A$402,'Lookup Values'!G$2:G$402)","v":"ERROR"},{"$f":"LOOKUP($V83,'Lookup Values'!$A$2:$A$402,'Lookup Values'!H$2:H$402)","v":"ERROR"},{"$f":"LOOKUP($V83,'Lookup Values'!$A$2:$A$402,'Lookup Values'!I$2:I$402)","v":"ERROR"},{"$f":"LOOKUP($V83,'Lookup Values'!$A$2:$A$402,'Lookup Values'!J$2:J$402)","v":"ERROR"},{"$f":"LOOKUP($V83,'Lookup Values'!$A$2:$A$402,'Lookup Values'!K$2:K$402)","v":"ERROR"},{"$f":"LOOKUP($V83,'Lookup Values'!$A$2:$A$402,'Lookup Values'!L$2:L$402)","v":"ERROR"},{"$f":"LOOKUP($V83,'Lookup Values'!$A$2:$A$402,'Lookup Values'!M$2:M$402)","v":"ERROR"},null,0,0,0,0,0,0,0,0,0,0,0,0,0,0,0,0,0,0,0,0,0,0,0,0,0,0,0,0,0,0,0,0,0,0,0,0,0,0,0,0,0,0,0,0,0,0,0,0,0,0,0,0,0,0,0,0,0,0,0,0,0,0,0,0,0,0,0,0,0,0,0,0,0,0,0,0,0,0,0,0,0,0,0,0,0,0,0,0,0,0,0,0,0,0,0,0,0,0,0,0,0,0,0,0,0,0,0,0,0,0,0,0,0,0,0,0,0,0,0,0,0,0,0,0,0,0,0,0,0,0,0,0,0,0,0,0]
[null,null,"","",null,null,null,null,"","","","","","","","","","","",null,null,{"$f":"IF(T84=\"\",402,MATCH(T84,'Lookup Values'!$B$1:$B$402,0))","v":402},{"$f":"LOOKUP($V84,'Lookup Values'!$A$2:$A$402,'Lookup Values'!C$2:C$402)","v":"ERROR"},{"$f":"LOOKUP($V84,'Lookup Values'!$A$2:$A$402,'Lookup Values'!D$2:D$402)","v":"ERROR"},{"$f":"LOOKUP($V84,'Lookup Values'!$A$2:$A$402,'Lookup Values'!E$2:E$402)","v":"ERROR"},{"$f":"LOOKUP($V84,'Lookup Values'!$A$2:$A$402,'Lookup Values'!F$2:F$402)","v":"ERROR"},{"$f":"LOOKUP($V84,'Lookup Values'!$A$2:$A$402,'Lookup Values'!G$2:G$402)","v":"ERROR"},{"$f":"LOOKUP($V84,'Lookup Values'!$A$2:$A$402,'Lookup Values'!H$2:H$402)","v":"ERROR"},{"$f":"LOOKUP($V84,'Lookup Values'!$A$2:$A$402,'Lookup Values'!I$2:I$402)","v":"ERROR"},{"$f":"LOOKUP($V84,'Lookup Values'!$A$2:$A$402,'Lookup Values'!J$2:J$402)","v":"ERROR"},{"$f":"LOOKUP($V84,'Lookup Values'!$A$2:$A$402,'Lookup Values'!K$2:K$402)","v":"ERROR"},{"$f":"LOOKUP($V84,'Lookup Values'!$A$2:$A$402,'Lookup Values'!L$2:L$402)","v":"ERROR"},{"$f":"LOOKUP($V84,'Lookup Values'!$A$2:$A$402,'Lookup Values'!M$2:M$402)","v":"ERROR"},null,0,0,0,0,0,0,0,0,0,0,0,0,0,0,0,0,0,0,0,0,0,0,0,0,0,0,0,0,0,0,0,0,0,0,0,0,0,0,0,0,0,0,0,0,0,0,0,0,0,0,0,0,0,0,0,0,0,0,0,0,0,0,0,0,0,0,0,0,0,0,0,0,0,0,0,0,0,0,0,0,0,0,0,0,0,0,0,0,0,0,0,0,0,0,0,0,0,0,0,0,0,0,0,0,0,0,0,0,0,0,0,0,0,0,0,0,0,0,0,0,0,0,0,0,0,0,0,0,0,0,0,0,0,0,0,0]
[null,null,"","",null,null,null,null,"","","","","","","","","","","",null,null,{"$f":"IF(T85=\"\",402,MATCH(T85,'Lookup Values'!$B$1:$B$402,0))","v":402},{"$f":"LOOKUP($V85,'Lookup Values'!$A$2:$A$402,'Lookup Values'!C$2:C$402)","v":"ERROR"},{"$f":"LOOKUP($V85,'Lookup Values'!$A$2:$A$402,'Lookup Values'!D$2:D$402)","v":"ERROR"},{"$f":"LOOKUP($V85,'Lookup Values'!$A$2:$A$402,'Lookup Values'!E$2:E$402)","v":"ERROR"},{"$f":"LOOKUP($V85,'Lookup Values'!$A$2:$A$402,'Lookup Values'!F$2:F$402)","v":"ERROR"},{"$f":"LOOKUP($V85,'Lookup Values'!$A$2:$A$402,'Lookup Values'!G$2:G$402)","v":"ERROR"},{"$f":"LOOKUP($V85,'Lookup Values'!$A$2:$A$402,'Lookup Values'!H$2:H$402)","v":"ERROR"},{"$f":"LOOKUP($V85,'Lookup Values'!$A$2:$A$402,'Lookup Values'!I$2:I$402)","v":"ERROR"},{"$f":"LOOKUP($V85,'Lookup Values'!$A$2:$A$402,'Lookup Values'!J$2:J$402)","v":"ERROR"},{"$f":"LOOKUP($V85,'Lookup Values'!$A$2:$A$402,'Lookup Values'!K$2:K$402)","v":"ERROR"},{"$f":"LOOKUP($V85,'Lookup Values'!$A$2:$A$402,'Lookup Values'!L$2:L$402)","v":"ERROR"},{"$f":"LOOKUP($V85,'Lookup Values'!$A$2:$A$402,'Lookup Values'!M$2:M$402)","v":"ERROR"},null,0,0,0,0,0,0,0,0,0,0,0,0,0,0,0,0,0,0,0,0,0,0,0,0,0,0,0,0,0,0,0,0,0,0,0,0,0,0,0,0,0,0,0,0,0,0,0,0,0,0,0,0,0,0,0,0,0,0,0,0,0,0,0,0,0,0,0,0,0,0,0,0,0,0,0,0,0,0,0,0,0,0,0,0,0,0,0,0,0,0,0,0,0,0,0,0,0,0,0,0,0,0,0,0,0,0,0,0,0,0,0,0,0,0,0,0,0,0,0,0,0,0,0,0,0,0,0,0,0,0,0,0,0,0,0,0]
[null,null,"","",null,null,null,null,"","","","","","","","","","","",null,null,{"$f":"IF(T86=\"\",402,MATCH(T86,'Lookup Values'!$B$1:$B$402,0))","v":402},{"$f":"LOOKUP($V86,'Lookup Values'!$A$2:$A$402,'Lookup Values'!C$2:C$402)","v":"ERROR"},{"$f":"LOOKUP($V86,'Lookup Values'!$A$2:$A$402,'Lookup Values'!D$2:D$402)","v":"ERROR"},{"$f":"LOOKUP($V86,'Lookup Values'!$A$2:$A$402,'Lookup Values'!E$2:E$402)","v":"ERROR"},{"$f":"LOOKUP($V86,'Lookup Values'!$A$2:$A$402,'Lookup Values'!F$2:F$402)","v":"ERROR"},{"$f":"LOOKUP($V86,'Lookup Values'!$A$2:$A$402,'Lookup Values'!G$2:G$402)","v":"ERROR"},{"$f":"LOOKUP($V86,'Lookup Values'!$A$2:$A$402,'Lookup Values'!H$2:H$402)","v":"ERROR"},{"$f":"LOOKUP($V86,'Lookup Values'!$A$2:$A$402,'Lookup Values'!I$2:I$402)","v":"ERROR"},{"$f":"LOOKUP($V86,'Lookup Values'!$A$2:$A$402,'Lookup Values'!J$2:J$402)","v":"ERROR"},{"$f":"LOOKUP($V86,'Lookup Values'!$A$2:$A$402,'Lookup Values'!K$2:K$402)","v":"ERROR"},{"$f":"LOOKUP($V86,'Lookup Values'!$A$2:$A$402,'Lookup Values'!L$2:L$402)","v":"ERROR"},{"$f":"LOOKUP($V86,'Lookup Values'!$A$2:$A$402,'Lookup Values'!M$2:M$402)","v":"ERROR"},null,0,0,0,0,0,0,0,0,0,0,0,0,0,0,0,0,0,0,0,0,0,0,0,0,0,0,0,0,0,0,0,0,0,0,0,0,0,0,0,0,0,0,0,0,0,0,0,0,0,0,0,0,0,0,0,0,0,0,0,0,0,0,0,0,0,0,0,0,0,0,0,0,0,0,0,0,0,0,0,0,0,0,0,0,0,0,0,0,0,0,0,0,0,0,0,0,0,0,0,0,0,0,0,0,0,0,0,0,0,0,0,0,0,0,0,0,0,0,0,0,0,0,0,0,0,0,0,0,0,0,0,0,0,0,0,0]
[null,null,"","",null,null,null,null,"","","","","","","","","","","",null,null,{"$f":"IF(T87=\"\",402,MATCH(T87,'Lookup Values'!$B$1:$B$402,0))","v":402},{"$f":"LOOKUP($V87,'Lookup Values'!$A$2:$A$402,'Lookup Values'!C$2:C$402)","v":"ERROR"},{"$f":"LOOKUP($V87,'Lookup Values'!$A$2:$A$402,'Lookup Values'!D$2:D$402)","v":"ERROR"},{"$f":"LOOKUP($V87,'Lookup Values'!$A$2:$A$402,'Lookup Values'!E$2:E$402)","v":"ERROR"},{"$f":"LOOKUP($V87,'Lookup Values'!$A$2:$A$402,'Lookup Values'!F$2:F$402)","v":"ERROR"},{"$f":"LOOKUP($V87,'Lookup Values'!$A$2:$A$402,'Lookup Values'!G$2:G$402)","v":"ERROR"},{"$f":"LOOKUP($V87,'Lookup Values'!$A$2:$A$402,'Lookup Values'!H$2:H$402)","v":"ERROR"},{"$f":"LOOKUP($V87,'Lookup Values'!$A$2:$A$402,'Lookup Values'!I$2:I$402)","v":"ERROR"},{"$f":"LOOKUP($V87,'Lookup Values'!$A$2:$A$402,'Lookup Values'!J$2:J$402)","v":"ERROR"},{"$f":"LOOKUP($V87,'Lookup Values'!$A$2:$A$402,'Lookup Values'!K$2:K$402)","v":"ERROR"},{"$f":"LOOKUP($V87,'Lookup Values'!$A$2:$A$402,'Lookup Values'!L$2:L$402)","v":"ERROR"},{"$f":"LOOKUP($V87,'Lookup Values'!$A$2:$A$402,'Lookup Values'!M$2:M$402)","v":"ERROR"},null,0,0,0,0,0,0,0,0,0,0,0,0,0,0,0,0,0,0,0,0,0,0,0,0,0,0,0,0,0,0,0,0,0,0,0,0,0,0,0,0,0,0,0,0,0,0,0,0,0,0,0,0,0,0,0,0,0,0,0,0,0,0,0,0,0,0,0,0,0,0,0,0,0,0,0,0,0,0,0,0,0,0,0,0,0,0,0,0,0,0,0,0,0,0,0,0,0,0,0,0,0,0,0,0,0,0,0,0,0,0,0,0,0,0,0,0,0,0,0,0,0,0,0,0,0,0,0,0,0,0,0,0,0,0,0,0]
[null,null,"","",null,null,null,null,"","","","","","","","","","","",null,null,{"$f":"IF(T88=\"\",402,MATCH(T88,'Lookup Values'!$B$1:$B$402,0))","v":402},{"$f":"LOOKUP($V88,'Lookup Values'!$A$2:$A$402,'Lookup Values'!C$2:C$402)","v":"ERROR"},{"$f":"LOOKUP($V88,'Lookup Values'!$A$2:$A$402,'Lookup Values'!D$2:D$402)","v":"ERROR"},{"$f":"LOOKUP($V88,'Lookup Values'!$A$2:$A$402,'Lookup Values'!E$2:E$402)","v":"ERROR"},{"$f":"LOOKUP($V88,'Lookup Values'!$A$2:$A$402,'Lookup Values'!F$2:F$402)","v":"ERROR"},{"$f":"LOOKUP($V88,'Lookup Values'!$A$2:$A$402,'Lookup Values'!G$2:G$402)","v":"ERROR"},{"$f":"LOOKUP($V88,'Lookup Values'!$A$2:$A$402,'Lookup Values'!H$2:H$402)","v":"ERROR"},{"$f":"LOOKUP($V88,'Lookup Values'!$A$2:$A$402,'Lookup Values'!I$2:I$402)","v":"ERROR"},{"$f":"LOOKUP($V88,'Lookup Values'!$A$2:$A$402,'Lookup Values'!J$2:J$402)","v":"ERROR"},{"$f":"LOOKUP($V88,'Lookup Values'!$A$2:$A$402,'Lookup Values'!K$2:K$402)","v":"ERROR"},{"$f":"LOOKUP($V88,'Lookup Values'!$A$2:$A$402,'Lookup Values'!L$2:L$402)","v":"ERROR"},{"$f":"LOOKUP($V88,'Lookup Values'!$A$2:$A$402,'Lookup Values'!M$2:M$402)","v":"ERROR"},null,0,0,0,0,0,0,0,0,0,0,0,0,0,0,0,0,0,0,0,0,0,0,0,0,0,0,0,0,0,0,0,0,0,0,0,0,0,0,0,0,0,0,0,0,0,0,0,0,0,0,0,0,0,0,0,0,0,0,0,0,0,0,0,0,0,0,0,0,0,0,0,0,0,0,0,0,0,0,0,0,0,0,0,0,0,0,0,0,0,0,0,0,0,0,0,0,0,0,0,0,0,0,0,0,0,0,0,0,0,0,0,0,0,0,0,0,0,0,0,0,0,0,0,0,0,0,0,0,0,0,0,0,0,0,0,0]
[null,null,"","",null,null,null,null,"","","","","","","","","","","",null,null,{"$f":"IF(T89=\"\",402,MATCH(T89,'Lookup Values'!$B$1:$B$402,0))","v":402},{"$f":"LOOKUP($V89,'Lookup Values'!$A$2:$A$402,'Lookup Values'!C$2:C$402)","v":"ERROR"},{"$f":"LOOKUP($V89,'Lookup Values'!$A$2:$A$402,'Lookup Values'!D$2:D$402)","v":"ERROR"},{"$f":"LOOKUP($V89,'Lookup Values'!$A$2:$A$402,'Lookup Values'!E$2:E$402)","v":"ERROR"},{"$f":"LOOKUP($V89,'Lookup Values'!$A$2:$A$402,'Lookup Values'!F$2:F$402)","v":"ERROR"},{"$f":"LOOKUP($V89,'Lookup Values'!$A$2:$A$402,'Lookup Values'!G$2:G$402)","v":"ERROR"},{"$f":"LOOKUP($V89,'Lookup Values'!$A$2:$A$402,'Lookup Values'!H$2:H$402)","v":"ERROR"},{"$f":"LOOKUP($V89,'Lookup Values'!$A$2:$A$402,'Lookup Values'!I$2:I$402)","v":"ERROR"},{"$f":"LOOKUP($V89,'Lookup Values'!$A$2:$A$402,'Lookup Values'!J$2:J$402)","v":"ERROR"},{"$f":"LOOKUP($V89,'Lookup Values'!$A$2:$A$402,'Lookup Values'!K$2:K$402)","v":"ERROR"},{"$f":"LOOKUP($V89,'Lookup Values'!$A$2:$A$402,'Lookup Values'!L$2:L$402)","v":"ERROR"},{"$f":"LOOKUP($V89,'Lookup Values'!$A$2:$A$402,'Lookup Values'!M$2:M$402)","v":"ERROR"},null,0,0,0,0,0,0,0,0,0,0,0,0,0,0,0,0,0,0,0,0,0,0,0,0,0,0,0,0,0,0,0,0,0,0,0,0,0,0,0,0,0,0,0,0,0,0,0,0,0,0,0,0,0,0,0,0,0,0,0,0,0,0,0,0,0,0,0,0,0,0,0,0,0,0,0,0,0,0,0,0,0,0,0,0,0,0,0,0,0,0,0,0,0,0,0,0,0,0,0,0,0,0,0,0,0,0,0,0,0,0,0,0,0,0,0,0,0,0,0,0,0,0,0,0,0,0,0,0,0,0,0,0,0,0,0,0]
[null,null,"","",null,null,null,null,"","","","","","","","","","","",null,null,{"$f":"IF(T90=\"\",402,MATCH(T90,'Lookup Values'!$B$1:$B$402,0))","v":402},{"$f":"LOOKUP($V90,'Lookup Values'!$A$2:$A$402,'Lookup Values'!C$2:C$402)","v":"ERROR"},{"$f":"LOOKUP($V90,'Lookup Values'!$A$2:$A$402,'Lookup Values'!D$2:D$402)","v":"ERROR"},{"$f":"LOOKUP($V90,'Lookup Values'!$A$2:$A$402,'Lookup Values'!E$2:E$402)","v":"ERROR"},{"$f":"LOOKUP($V90,'Lookup Values'!$A$2:$A$402,'Lookup Values'!F$2:F$402)","v":"ERROR"},{"$f":"LOOKUP($V90,'Lookup Values'!$A$2:$A$402,'Lookup Values'!G$2:G$402)","v":"ERROR"},{"$f":"LOOKUP($V90,'Lookup Values'!$A$2:$A$402,'Lookup Values'!H$2:H$402)","v":"ERROR"},{"$f":"LOOKUP($V90,'Lookup Values'!$A$2:$A$402,'Lookup Values'!I$2:I$402)","v":"ERROR"},{"$f":"LOOKUP($V90,'Lookup Values'!$A$2:$A$402,'Lookup Values'!J$2:J$402)","v":"ERROR"},{"$f":"LOOKUP($V90,'Lookup Values'!$A$2:$A$402,'Lookup Values'!K$2:K$402)","v":"ERROR"},{"$f":"LOOKUP($V90,'Lookup Values'!$A$2:$A$402,'Lookup Values'!L$2:L$402)","v":"ERROR"},{"$f":"LOOKUP($V90,'Lookup Values'!$A$2:$A$402,'Lookup Values'!M$2:M$402)","v":"ERROR"},null,0,0,0,0,0,0,0,0,0,0,0,0,0,0,0,0,0,0,0,0,0,0,0,0,0,0,0,0,0,0,0,0,0,0,0,0,0,0,0,0,0,0,0,0,0,0,0,0,0,0,0,0,0,0,0,0,0,0,0,0,0,0,0,0,0,0,0,0,0,0,0,0,0,0,0,0,0,0,0,0,0,0,0,0,0,0,0,0,0,0,0,0,0,0,0,0,0,0,0,0,0,0,0,0,0,0,0,0,0,0,0,0,0,0,0,0,0,0,0,0,0,0,0,0,0,0,0,0,0,0,0,0,0,0,0,0]
[null,null,{"$f":"IF(AND(A91=0,B91=0),\"\",IF(OR(G91=\"BRIDGE\",G92=\"BRIDGE\"),\"\",IF(G90=\"BRIDGE\",B91-A89,B91-A91)))","v":""},{"$f":"IF(C91=\"\",\"\",IF(G90=\"BRIDGE\",C91+E90-F90,IF(C91+E91-F91=0,\"\",C91+E91-F91)))","v":""},null,null,null,null,"","","","","","","","","","","",null,null,{"$f":"IF(T91=\"\",402,MATCH(T91,'Lookup Values'!$B$1:$B$402,0))","v":402},{"$f":"LOOKUP($V91,'Lookup Values'!$A$2:$A$402,'Lookup Values'!C$2:C$402)","v":"ERROR"},{"$f":"LOOKUP($V91,'Lookup Values'!$A$2:$A$402,'Lookup Values'!D$2:D$402)","v":"ERROR"},{"$f":"LOOKUP($V91,'Lookup Values'!$A$2:$A$402,'Lookup Values'!E$2:E$402)","v":"ERROR"},{"$f":"LOOKUP($V91,'Lookup Values'!$A$2:$A$402,'Lookup Values'!F$2:F$402)","v":"ERROR"},{"$f":"LOOKUP($V91,'Lookup Values'!$A$2:$A$402,'Lookup Values'!G$2:G$402)","v":"ERROR"},{"$f":"LOOKUP($V91,'Lookup Values'!$A$2:$A$402,'Lookup Values'!H$2:H$402)","v":"ERROR"},{"$f":"LOOKUP($V91,'Lookup Values'!$A$2:$A$402,'Lookup Values'!I$2:I$402)","v":"ERROR"},{"$f":"LOOKUP($V91,'Lookup Values'!$A$2:$A$402,'Lookup Values'!J$2:J$402)","v":"ERROR"},{"$f":"LOOKUP($V91,'Lookup Values'!$A$2:$A$402,'Lookup Values'!K$2:K$402)","v":"ERROR"},{"$f":"LOOKUP($V91,'Lookup Values'!$A$2:$A$402,'Lookup Values'!L$2:L$402)","v":"ERROR"},{"$f":"LOOKUP($V91,'Lookup Values'!$A$2:$A$402,'Lookup Values'!M$2:M$402)","v":"ERROR"},null,0,0,0,0,0,0,0,0,0,0,0,0,0,0,0,0,0,0,0,0,0,0,0,0,0,0,0,0,0,0,0,0,0,0,0,0,0,0,0,0,0,0,0,0,0,0,0,0,0,0,0,0,0,0,0,0,0,0,0,0,0,0,0,0,0,0,0,0,0,0,0,0,0,0,0,0,0,0,0,0,0,0,0,0,0,0,0,0,0,0,0,0,0,0,0,0,0,0,0,0,0,0,0,0,0,0,0,0,0,0,0,0,0,0,0,0,0,0,0,0,0,0,0,0,0,0,0,0,0,0,0,0,0,0,0,0]
[null,null,"","",null,null,null,null,"","","","","","","","","","","",null,null,{"$f":"IF(T92=\"\",402,MATCH(T92,'Lookup Values'!$B$1:$B$402,0))","v":402},{"$f":"LOOKUP($V92,'Lookup Values'!$A$2:$A$402,'Lookup Values'!C$2:C$402)","v":"ERROR"},{"$f":"LOOKUP($V92,'Lookup Values'!$A$2:$A$402,'Lookup Values'!D$2:D$402)","v":"ERROR"},{"$f":"LOOKUP($V92,'Lookup Values'!$A$2:$A$402,'Lookup Values'!E$2:E$402)","v":"ERROR"},{"$f":"LOOKUP($V92,'Lookup Values'!$A$2:$A$402,'Lookup Values'!F$2:F$402)","v":"ERROR"},{"$f":"LOOKUP($V92,'Lookup Values'!$A$2:$A$402,'Lookup Values'!G$2:G$402)","v":"ERROR"},{"$f":"LOOKUP($V92,'Lookup Values'!$A$2:$A$402,'Lookup Values'!H$2:H$402)","v":"ERROR"},{"$f":"LOOKUP($V92,'Lookup Values'!$A$2:$A$402,'Lookup Values'!I$2:I$402)","v":"ERROR"},{"$f":"LOOKUP($V92,'Lookup Values'!$A$2:$A$402,'Lookup Values'!J$2:J$402)","v":"ERROR"},{"$f":"LOOKUP($V92,'Lookup Values'!$A$2:$A$402,'Lookup Values'!K$2:K$402)","v":"ERROR"},{"$f":"LOOKUP($V92,'Lookup Values'!$A$2:$A$402,'Lookup Values'!L$2:L$402)","v":"ERROR"},{"$f":"LOOKUP($V92,'Lookup Values'!$A$2:$A$402,'Lookup Values'!M$2:M$402)","v":"ERROR"},null,0,0,0,0,0,0,0,0,0,0,0,0,0,0,0,0,0,0,0,0,0,0,0,0,0,0,0,0,0,0,0,0,0,0,0,0,0,0,0,0,0,0,0,0,0,0,0,0,0,0,0,0,0,0,0,0,0,0,0,0,0,0,0,0,0,0,0,0,0,0,0,0,0,0,0,0,0,0,0,0,0,0,0,0,0,0,0,0,0,0,0,0,0,0,0,0,0,0,0,0,0,0,0,0,0,0,0,0,0,0,0,0,0,0,0,0,0,0,0,0,0,0,0,0,0,0,0,0,0,0,0,0,0,0,0,0]
[null,null,"","",null,null,null,null,"","","","","","","","","","","",null,null,{"$f":"IF(T93=\"\",402,MATCH(T93,'Lookup Values'!$B$1:$B$402,0))","v":402},{"$f":"LOOKUP($V93,'Lookup Values'!$A$2:$A$402,'Lookup Values'!C$2:C$402)","v":"ERROR"},{"$f":"LOOKUP($V93,'Lookup Values'!$A$2:$A$402,'Lookup Values'!D$2:D$402)","v":"ERROR"},{"$f":"LOOKUP($V93,'Lookup Values'!$A$2:$A$402,'Lookup Values'!E$2:E$402)","v":"ERROR"},{"$f":"LOOKUP($V93,'Lookup Values'!$A$2:$A$402,'Lookup Values'!F$2:F$402)","v":"ERROR"},{"$f":"LOOKUP($V93,'Lookup Values'!$A$2:$A$402,'Lookup Values'!G$2:G$402)","v":"ERROR"},{"$f":"LOOKUP($V93,'Lookup Values'!$A$2:$A$402,'Lookup Values'!H$2:H$402)","v":"ERROR"},{"$f":"LOOKUP($V93,'Lookup Values'!$A$2:$A$402,'Lookup Values'!I$2:I$402)","v":"ERROR"},{"$f":"LOOKUP($V93,'Lookup Values'!$A$2:$A$402,'Lookup Values'!J$2:J$402)","v":"ERROR"},{"$f":"LOOKUP($V93,'Lookup Values'!$A$2:$A$402,'Lookup Values'!K$2:K$402)","v":"ERROR"},{"$f":"LOOKUP($V93,'Lookup Values'!$A$2:$A$402,'Lookup Values'!L$2:L$402)","v":"ERROR"},{"$f":"LOOKUP($V93,'Lookup Values'!$A$2:$A$402,'Lookup Values'!M$2:M$402)","v":"ERROR"},null,0,0,0,0,0,0,0,0,0,0,0,0,0,0,0,0,0,0,0,0,0,0,0,0,0,0,0,0,0,0,0,0,0,0,0,0,0,0,0,0,0,0,0,0,0,0,0,0,0,0,0,0,0,0,0,0,0,0,0,0,0,0,0,0,0,0,0,0,0,0,0,0,0,0,0,0,0,0,0,0,0,0,0,0,0,0,0,0,0,0,0,0,0,0,0,0,0,0,0,0,0,0,0,0,0,0,0,0,0,0,0,0,0,0,0,0,0,0,0,0,0,0,0,0,0,0,0,0,0,0,0,0,0,0,0,0]
[null,null,"","",null,null,null,null,"","","","","","","","","","","",null,null,{"$f":"IF(T94=\"\",402,MATCH(T94,'Lookup Values'!$B$1:$B$402,0))","v":402},{"$f":"LOOKUP($V94,'Lookup Values'!$A$2:$A$402,'Lookup Values'!C$2:C$402)","v":"ERROR"},{"$f":"LOOKUP($V94,'Lookup Values'!$A$2:$A$402,'Lookup Values'!D$2:D$402)","v":"ERROR"},{"$f":"LOOKUP($V94,'Lookup Values'!$A$2:$A$402,'Lookup Values'!E$2:E$402)","v":"ERROR"},{"$f":"LOOKUP($V94,'Lookup Values'!$A$2:$A$402,'Lookup Values'!F$2:F$402)","v":"ERROR"},{"$f":"LOOKUP($V94,'Lookup Values'!$A$2:$A$402,'Lookup Values'!G$2:G$402)","v":"ERROR"},{"$f":"LOOKUP($V94,'Lookup Values'!$A$2:$A$402,'Lookup Values'!H$2:H$402)","v":"ERROR"},{"$f":"LOOKUP($V94,'Lookup Values'!$A$2:$A$402,'Lookup Values'!I$2:I$402)","v":"ERROR"},{"$f":"LOOKUP($V94,'Lookup Values'!$A$2:$A$402,'Lookup Values'!J$2:J$402)","v":"ERROR"},{"$f":"LOOKUP($V94,'Lookup Values'!$A$2:$A$402,'Lookup Values'!K$2:K$402)","v":"ERROR"},{"$f":"LOOKUP($V94,'Lookup Values'!$A$2:$A$402,'Lookup Values'!L$2:L$402)","v":"ERROR"},{"$f":"LOOKUP($V94,'Lookup Values'!$A$2:$A$402,'Lookup Values'!M$2:M$402)","v":"ERROR"},null,0,0,0,0,0,0,0,0,0,0,0,0,0,0,0,0,0,0,0,0,0,0,0,0,0,0,0,0,0,0,0,0,0,0,0,0,0,0,0,0,0,0,0,0,0,0,0,0,0,0,0,0,0,0,0,0,0,0,0,0,0,0,0,0,0,0,0,0,0,0,0,0,0,0,0,0,0,0,0,0,0,0,0,0,0,0,0,0,0,0,0,0,0,0,0,0,0,0,0,0,0,0,0,0,0,0,0,0,0,0,0,0,0,0,0,0,0,0,0,0,0,0,0,0,0,0,0,0,0,0,0,0,0,0,0,0]
[null,null,"","",null,null,null,null,"","","","","","","","","","","",null,null,{"$f":"IF(T95=\"\",402,MATCH(T95,'Lookup Values'!$B$1:$B$402,0))","v":402},{"$f":"LOOKUP($V95,'Lookup Values'!$A$2:$A$402,'Lookup Values'!C$2:C$402)","v":"ERROR"},{"$f":"LOOKUP($V95,'Lookup Values'!$A$2:$A$402,'Lookup Values'!D$2:D$402)","v":"ERROR"},{"$f":"LOOKUP($V95,'Lookup Values'!$A$2:$A$402,'Lookup Values'!E$2:E$402)","v":"ERROR"},{"$f":"LOOKUP($V95,'Lookup Values'!$A$2:$A$402,'Lookup Values'!F$2:F$402)","v":"ERROR"},{"$f":"LOOKUP($V95,'Lookup Values'!$A$2:$A$402,'Lookup Values'!G$2:G$402)","v":"ERROR"},{"$f":"LOOKUP($V95,'Lookup Values'!$A$2:$A$402,'Lookup Values'!H$2:H$402)","v":"ERROR"},{"$f":"LOOKUP($V95,'Lookup Values'!$A$2:$A$402,'Lookup Values'!I$2:I$402)","v":"ERROR"},{"$f":"LOOKUP($V95,'Lookup Values'!$A$2:$A$402,'Lookup Values'!J$2:J$402)","v":"ERROR"},{"$f":"LOOKUP($V95,'Lookup Values'!$A$2:$A$402,'Lookup Values'!K$2:K$402)","v":"ERROR"},{"$f":"LOOKUP($V95,'Lookup Values'!$A$2:$A$402,'Lookup Values'!L$2:L$402)","v":"ERROR"},{"$f":"LOOKUP($V95,'Lookup Values'!$A$2:$A$402,'Lookup Values'!M$2:M$402)","v":"ERROR"},null,0,0,0,0,0,0,0,0,0,0,0,0,0,0,0,0,0,0,0,0,0,0,0,0,0,0,0,0,0,0,0,0,0,0,0,0,0,0,0,0,0,0,0,0,0,0,0,0,0,0,0,0,0,0,0,0,0,0,0,0,0,0,0,0,0,0,0,0,0,0,0,0,0,0,0,0,0,0,0,0,0,0,0,0,0,0,0,0,0,0,0,0,0,0,0,0,0,0,0,0,0,0,0,0,0,0,0,0,0,0,0,0,0,0,0,0,0,0,0,0,0,0,0,0,0,0,0,0,0,0,0,0,0,0,0,0]
[null,null,"","",null,null,null,null,"","","","","","","","","","","",null,null,{"$f":"IF(T96=\"\",402,MATCH(T96,'Lookup Values'!$B$1:$B$402,0))","v":402},{"$f":"LOOKUP($V96,'Lookup Values'!$A$2:$A$402,'Lookup Values'!C$2:C$402)","v":"ERROR"},{"$f":"LOOKUP($V96,'Lookup Values'!$A$2:$A$402,'Lookup Values'!D$2:D$402)","v":"ERROR"},{"$f":"LOOKUP($V96,'Lookup Values'!$A$2:$A$402,'Lookup Values'!E$2:E$402)","v":"ERROR"},{"$f":"LOOKUP($V96,'Lookup Values'!$A$2:$A$402,'Lookup Values'!F$2:F$402)","v":"ERROR"},{"$f":"LOOKUP($V96,'Lookup Values'!$A$2:$A$402,'Lookup Values'!G$2:G$402)","v":"ERROR"},{"$f":"LOOKUP($V96,'Lookup Values'!$A$2:$A$402,'Lookup Values'!H$2:H$402)","v":"ERROR"},{"$f":"LOOKUP($V96,'Lookup Values'!$A$2:$A$402,'Lookup Values'!I$2:I$402)","v":"ERROR"},{"$f":"LOOKUP($V96,'Lookup Values'!$A$2:$A$402,'Lookup Values'!J$2:J$402)","v":"ERROR"},{"$f":"LOOKUP($V96,'Lookup Values'!$A$2:$A$402,'Lookup Values'!K$2:K$402)","v":"ERROR"},{"$f":"LOOKUP($V96,'Lookup Values'!$A$2:$A$402,'Lookup Values'!L$2:L$402)","v":"ERROR"},{"$f":"LOOKUP($V96,'Lookup Values'!$A$2:$A$402,'Lookup Values'!M$2:M$402)","v":"ERROR"},null,0,0,0,0,0,0,0,0,0,0,0,0,0,0,0,0,0,0,0,0,0,0,0,0,0,0,0,0,0,0,0,0,0,0,0,0,0,0,0,0,0,0,0,0,0,0,0,0,0,0,0,0,0,0,0,0,0,0,0,0,0,0,0,0,0,0,0,0,0,0,0,0,0,0,0,0,0,0,0,0,0,0,0,0,0,0,0,0,0,0,0,0,0,0,0,0,0,0,0,0,0,0,0,0,0,0,0,0,0,0,0,0,0,0,0,0,0,0,0,0,0,0,0,0,0,0,0,0,0,0,0,0,0,0,0,0]
[null,null,"","",null,null,null,null,"","","","","","","","","","","",null,null,{"$f":"IF(T97=\"\",402,MATCH(T97,'Lookup Values'!$B$1:$B$402,0))","v":402},{"$f":"LOOKUP($V97,'Lookup Values'!$A$2:$A$402,'Lookup Values'!C$2:C$402)","v":"ERROR"},{"$f":"LOOKUP($V97,'Lookup Values'!$A$2:$A$402,'Lookup Values'!D$2:D$402)","v":"ERROR"},{"$f":"LOOKUP($V97,'Lookup Values'!$A$2:$A$402,'Lookup Values'!E$2:E$402)","v":"ERROR"},{"$f":"LOOKUP($V97,'Lookup Values'!$A$2:$A$402,'Lookup Values'!F$2:F$402)","v":"ERROR"},{"$f":"LOOKUP($V97,'Lookup Values'!$A$2:$A$402,'Lookup Values'!G$2:G$402)","v":"ERROR"},{"$f":"LOOKUP($V97,'Lookup Values'!$A$2:$A$402,'Lookup Values'!H$2:H$402)","v":"ERROR"},{"$f":"LOOKUP($V97,'Lookup Values'!$A$2:$A$402,'Lookup Values'!I$2:I$402)","v":"ERROR"},{"$f":"LOOKUP($V97,'Lookup Values'!$A$2:$A$402,'Lookup Values'!J$2:J$402)","v":"ERROR"},{"$f":"LOOKUP($V97,'Lookup Values'!$A$2:$A$402,'Lookup Values'!K$2:K$402)","v":"ERROR"},{"$f":"LOOKUP($V97,'Lookup Values'!$A$2:$A$402,'Lookup Values'!L$2:L$402)","v":"ERROR"},{"$f":"LOOKUP($V97,'Lookup Values'!$A$2:$A$402,'Lookup Values'!M$2:M$402)","v":"ERROR"},null,0,0,0,0,0,0,0,0,0,0,0,0,0,0,0,0,0,0,0,0,0,0,0,0,0,0,0,0,0,0,0,0,0,0,0,0,0,0,0,0,0,0,0,0,0,0,0,0,0,0,0,0,0,0,0,0,0,0,0,0,0,0,0,0,0,0,0,0,0,0,0,0,0,0,0,0,0,0,0,0,0,0,0,0,0,0,0,0,0,0,0,0,0,0,0,0,0,0,0,0,0,0,0,0,0,0,0,0,0,0,0,0,0,0,0,0,0,0,0,0,0,0,0,0,0,0,0,0,0,0,0,0,0,0,0,0]
[null,null,null,null,null,null,"ADD. SURF.",null,{"$f":"43+4532","v":4575},null,{"$f":"18+10279","v":10297},null,null,null,{"$f":"0.4+109","v":109.4},{"$f":"0.1+10.6","v":10.7},{"$f":"14672+61","v":14733},{"$f":"715+0","v":715},null,null,null,{"$f":"IF(T98=\"\",402,MATCH(T98,'Lookup Values'!$B$1:$B$402,0))","v":402},{"$f":"LOOKUP($V98,'Lookup Values'!$A$2:$A$402,'Lookup Values'!C$2:C$402)","v":"ERROR"},{"$f":"LOOKUP($V98,'Lookup Values'!$A$2:$A$402,'Lookup Values'!D$2:D$402)","v":"ERROR"},{"$f":"LOOKUP($V98,'Lookup Values'!$A$2:$A$402,'Lookup Values'!E$2:E$402)","v":"ERROR"},{"$f":"LOOKUP($V98,'Lookup Values'!$A$2:$A$402,'Lookup Values'!F$2:F$402)","v":"ERROR"},{"$f":"LOOKUP($V98,'Lookup Values'!$A$2:$A$402,'Lookup Values'!G$2:G$402)","v":"ERROR"},{"$f":"LOOKUP($V98,'Lookup Values'!$A$2:$A$402,'Lookup Values'!H$2:H$402)","v":"ERROR"},{"$f":"LOOKUP($V98,'Lookup Values'!$A$2:$A$402,'Lookup Values'!I$2:I$402)","v":"ERROR"},{"$f":"LOOKUP($V98,'Lookup Values'!$A$2:$A$402,'Lookup Values'!J$2:J$402)","v":"ERROR"},{"$f":"LOOKUP($V98,'Lookup Values'!$A$2:$A$402,'Lookup Values'!K$2:K$402)","v":"ERROR"},{"$f":"LOOKUP($V98,'Lookup Values'!$A$2:$A$402,'Lookup Values'!L$2:L$402)","v":"ERROR"},{"$f":"LOOKUP($V98,'Lookup Values'!$A$2:$A$402,'Lookup Values'!M$2:M$402)","v":"ERROR"},null,0,0,0,0,0,0,0,0,0,0,0,0,0,0,0,0,0,0,0,0,0,0,0,0,0,0,0,0,0,0,0,0,0,0,0,0,0,0,0,0,0,0,0,0,0,0,0,0,0,0,0,0,0,0,0,0,0,0,0,0,0,0,0,0,0,0,0,0,0,0,0,0,0,0,0,0,0,0,0,0,0,0,0,0,0,0,0,0,0,0,0,0,0,0,0,0,0,0,0,0,0,0,0,0,0,0,0,0,0,0,0,0,0,0,0,0,0,0,0,0,0,0,0,0,0,0,0,0,0,0,0,0,0,0,0,0]
[]
["TOTAL",null,{"$f":"IF(SUM(C6:C98)=0,\"~\",SUM(C6:C98))","v":33243.82},{"$f":"IF(SUM(D6:D98)=0,\"~\",SUM(D6:D98))","v":33099.78},{"$f":"IF(SUM(E6:E98)=0,\"~\",SUM(E6:E98))","v":"~"},{"$f":"IF(SUM(F6:F98)=0,\"~\",SUM(F6:F98))","v":144.0399999999986},{"$f":"IF(SUM(G6:G98)=0,\"~\",SUM(G6:G98))","v":"~"},{"$f":"IF(J100=\"~\",\"~\",ROUND(J100*'Project&Typical Info'!F3/100,0))","v":177},{"$f":"IF(SUM(I6:I98)=0,\"~\",SUM(I6:I98))","v":66593},12666,32501,"~","~","~",794,122.39999999999999,84249,7683,4703,null,null,null,null,null,null,null,null,null,null,null,null,null,null,null,{"$f":"SUM(AI6:AI98)","v":649.31000000000017},16704.46,0,15138.65,0,0,0,0,0,0,0,0,0,0,0,0,0,34,0,0,0,473.36000000000058,0,0,0,0,0,0,0,0,100,0,{"$f":"SUM(BO6:BO98)","v":0},0,0,0,0,0,0,0,0,0,0,0,0,0,0,0,0,0,0,0,0,0,0,0,0,0,0,0,0,0,0,0,{"$f":"SUM(CU6:CU98)","v":0},0,0,0,0,0,0,0,0,0,0,0,0,0,0,0,0,0,0,0,0,0,0,0,0,0,0,0,0,0,0,0,{"$f":"SUM(EA6:EA98)","v":0},0,0,0,0,0,0,0,0,0,0,0,0,0,0,0,0,0,0,0,0,0,0,0,0,0,0,0,0,0,0,0,{"$f":"SUM(FG6:FG98)","v":0},0,0,0,0,0,0,0]
[null,null,null,null,null,null,null,null,null,null,null,null,null,null,null,null,null,null,null,null,null,null,null,null,null,null,null,null,null,null,null,null,null,null,"Area of Typical Sections (ft2)                                                                                    Area of Typical Sections (ft2)                                                                                    Area of Typical Sections (ft2)                                                                                    Area of Typical Sections (ft2)                                                                                    Area of Typical Sections (ft2)                                                                                    Area of Typical Sections (ft2)                                                                                    Area of Typical Sections (ft2)                                                                                    Area of Typical Sections (ft2)                                                                                    Area of Typical Sections (ft2)"]

{"sheet":"Typical Section Quantities","index":3,"n_rows":139,"n_cols":10,"rows_kept":139,"cut":false,"hidden":true,"merged":[[77,0,77,9],[84,0,84,9],[91,0,91,9],[126,0,126,9],[133,0,133,9],[112,0,112,9],[119,0,119,9],[0,0,0,9],[7,0,7,9],[14,0,14,9],[21,0,21,9],[28,0,28,9],[35,0,35,9],[42,0,42,9],[49,0,49,9],[98,0,98,9],[105,0,105,9],[56,0,56,9],[63,0,63,9],[70,0,70,9]]}
["TYPICAL SECTION NO. 1 QUANTITIES"]
["UNIT","COVER","PLANT MIX","CR. AGG. COURSE","UNIT","ASPHALT CEMENT","SEAL","AGG. TREAT.","EMULS. ASPHALT TACK","EMULS. ASPHALT FOG SEAL"]
["AREA square feet",null,{"$f":"ROUND('Project&Typical Info'!P41,2)","v":10.199999999999999},{"$f":"ROUND('Project&Typical Info'!Q41,2)","v":35.53},"square yards PER STATION",null,{"$f":"ROUND(B6,0)","v":356},{"$f":"ROUND('Project&Typical Info'!I41,0)","v":400},{"$f":"ROUND('Project&Typical Info'!J41,0)","v":800},{"$f":"ROUND(B6,0)","v":356}]
["cubic yards PER STATION",null,{"$f":"ROUND('Project&Typical Info'!C41,1)","v":37.799999999999997},{"$f":"ROUND('Project&Typical Info'!D41,1)","v":131.6},"tons PER STATION",{"$f":"ROUND('Project&Typical Info'!G41,2)","v":3.94},{"$f":"ROUND('Project&Typical Info'!H41,2)","v":0.64}]
["tons PER STATION",null,{"$f":"ROUND('Project&Typical Info'!E41,1)","v":72.900000000000006},null,"gallons PER STATION",null,null,null,{"$f":"ROUND('Project&Typical Info'!K41,0)","v":40},{"$f":"ROUND('Project&Typical Info'!L41,0)","v":27}]
["square yards PER STATION",{"$f":"ROUND('Project&Typical Info'!B41,0)","v":356}]
[]
["TYPICAL SECTION NO. 2 QUANTITIES"]
["UNIT","COVER","PLANT MIX","CR. AGG. COURSE","UNIT","ASPHALT CEMENT","SEAL","AGG. TREAT.","EMULS. ASPHALT TACK","EMULS. ASPHALT FOG SEAL"]
["AREA square feet",null,{"$f":"ROUND('Project&Typical Info'!P42,2)","v":10.19},{"$f":"ROUND('Project&Typical Info'!Q42,2)","v":34.369999999999997},"square yards PER STATION",null,{"$f":"ROUND(B13,0)","v":356},{"$f":"ROUND('Project&Typical Info'!I42,0)","v":399},{"$f":"ROUND('Project&Typical Info'!J42,0)","v":798},{"$f":"ROUND(B13,0)","v":356}]
["cubic yards PER STATION",null,{"$f":"ROUND('Project&Typical Info'!C42,1)","v":37.700000000000003},{"$f":"ROUND('Project&Typical Info'!D42,1)","v":127.3},"tons PER STATION",{"$f":"ROUND('Project&Typical Info'!G42,2)","v":3.93},{"$f":"ROUND('Project&Typical Info'!H42,2)","v":0.64}]
["tons PER STATION",null,{"$f":"ROUND('Project&Typical Info'!E42,1)","v":72.7},null,"gallons PER STATION",null,null,null,{"$f":"ROUND('Project&Typical Info'!K42,0)","v":40},{"$f":"ROUND('Project&Typical Info'!L42,0)","v":27}]
["square yards PER STATION",{"$f":"ROUND('Project&Typical Info'!B42,0)","v":356}]
[]
["TYPICAL SECTION NO. 3 QUANTITIES"]
["UNIT","COVER","PLANT MIX","CR. AGG. COURSE","UNIT","ASPHALT CEMENT","SEAL","AGG. TREAT.","EMULS. ASPHALT TACK","EMULS. ASPHALT FOG SEAL"]
["AREA square feet",null,{"$f":"ROUND('Project&Typical Info'!P43,2)","v":0},{"$f":"ROUND('Project&Typical Info'!Q43,2)","v":0},"square yards PER STATION",null,{"$f":"ROUND(B20,0)","v":0},{"$f":"ROUND('Project&Typical Info'!I43,0)","v":0},{"$f":"ROUND('Project&Typical Info'!J43,0)","v":0},{"$f":"ROUND(B20,0)","v":0}]
["cubic yards PER STATION",null,{"$f":"ROUND('Project&Typical Info'!C43,1)","v":0},{"$f":"ROUND('Project&Typical Info'!D43,1)","v":0},"tons PER STATION",{"$f":"ROUND('Project&Typical Info'!G43,2)","v":0},{"$f":"ROUND('Project&Typical Info'!H43,2)","v":0}]
["tons PER STATION",null,{"$f":"ROUND('Project&Typical Info'!E43,1)","v":0},null,"gallons PER STATION",null,null,null,{"$f":"ROUND('Project&Typical Info'!K43,0)","v":0},{"$f":"ROUND('Project&Typical Info'!L43,0)","v":0}]
["square yards PER STATION",{"$f":"ROUND('Project&Typical Info'!B43,0)","v":0}]
[]
["TYPICAL SECTION NO. 4 QUANTITIES"]
["UNIT","COVER","PLANT MIX","CR. AGG. COURSE","UNIT","ASPHALT CEMENT","SEAL","AGG. TREAT.","EMULS. ASPHALT TACK","EMULS. ASPHALT FOG SEAL"]
["AREA square feet",null,{"$f":"ROUND('Project&Typical Info'!P44,2)","v":0},{"$f":"ROUND('Project&Typical Info'!Q44,2)","v":0},"square yards PER STATION",null,{"$f":"ROUND(B27,0)","v":0},{"$f":"ROUND('Project&Typical Info'!I44,0)","v":0},{"$f":"ROUND('Project&Typical Info'!J44,0)","v":0},{"$f":"ROUND(B27,0)","v":0}]
["cubic yards PER STATION",null,{"$f":"ROUND('Project&Typical Info'!C44,1)","v":0},{"$f":"ROUND('Project&Typical Info'!D44,1)","v":0},"tons PER STATION",{"$f":"ROUND('Project&Typical Info'!G44,2)","v":0},{"$f":"ROUND('Project&Typical Info'!H44,2)","v":0}]
["tons PER STATION",null,{"$f":"ROUND('Project&Typical Info'!E44,1)","v":0},null,"gallons PER STATION",null,null,null,{"$f":"ROUND('Project&Typical Info'!K44,0)","v":0},{"$f":"ROUND('Project&Typical Info'!L44,0)","v":0}]
["square yards PER STATION",{"$f":"ROUND('Project&Typical Info'!B44,0)","v":0}]
[]
["TYPICAL SECTION NO. 5 QUANTITIES"]
["UNIT","COVER","PLANT MIX","CR. AGG. COURSE","UNIT","ASPHALT CEMENT","SEAL","AGG. TREAT.","EMULS. ASPHALT TACK","EMULS. ASPHALT FOG SEAL"]
["AREA square feet",null,{"$f":"ROUND('Project&Typical Info'!P45,2)","v":0},{"$f":"ROUND('Project&Typical Info'!Q45,2)","v":0},"square yards PER STATION",null,{"$f":"ROUND(B34,0)","v":0},{"$f":"ROUND('Project&Typical Info'!I45,0)","v":0},{"$f":"ROUND('Project&Typical Info'!J45,0)","v":0},{"$f":"ROUND(B34,0)","v":0}]
["cubic yards PER STATION",null,{"$f":"ROUND('Project&Typical Info'!C45,1)","v":0},{"$f":"ROUND('Project&Typical Info'!D45,1)","v":0},"tons PER STATION",{"$f":"ROUND('Project&Typical Info'!G45,2)","v":0},{"$f":"ROUND('Project&Typical Info'!H45,2)","v":0}]
["tons PER STATION",null,{"$f":"ROUND('Project&Typical Info'!E45,1)","v":0},null,"gallons PER STATION",null,null,null,{"$f":"ROUND('Project&Typical Info'!K45,0)","v":0},{"$f":"ROUND('Project&Typical Info'!L45,0)","v":0}]
["square yards PER STATION",{"$f":"ROUND('Project&Typical Info'!B45,0)","v":0}]
[]
["TYPICAL SECTION NO. 6 QUANTITIES"]
["UNIT","COVER","PLANT MIX","CR. AGG. COURSE","UNIT","ASPHALT CEMENT","SEAL","AGG. TREAT.","EMULS. ASPHALT TACK","EMULS. ASPHALT FOG SEAL"]
["AREA square feet",null,{"$f":"ROUND('Project&Typical Info'!P46,2)","v":0},{"$f":"ROUND('Project&Typical Info'!Q46,2)","v":0},"square yards PER STATION",null,{"$f":"ROUND(B41,0)","v":0},{"$f":"ROUND('Project&Typical Info'!I46,0)","v":0},{"$f":"ROUND('Project&Typical Info'!J46,0)","v":0},{"$f":"ROUND(B41,0)","v":0}]
["cubic yards PER STATION",null,{"$f":"ROUND('Project&Typical Info'!C46,1)","v":0},{"$f":"ROUND('Project&Typical Info'!D46,1)","v":0},"tons PER STATION",{"$f":"ROUND('Project&Typical Info'!G46,2)","v":0},{"$f":"ROUND('Project&Typical Info'!H46,2)","v":0}]
["tons PER STATION",null,{"$f":"ROUND('Project&Typical Info'!E46,1)","v":0},null,"gallons PER STATION",null,null,null,{"$f":"ROUND('Project&Typical Info'!K46,0)","v":0},{"$f":"ROUND('Project&Typical Info'!L46,0)","v":0}]
["square yards PER STATION",{"$f":"ROUND('Project&Typical Info'!B46,0)","v":0}]
[]
["TYPICAL SECTION NO. 7 QUANTITIES"]
["UNIT","COVER","PLANT MIX","CR. AGG. COURSE","UNIT","ASPHALT CEMENT","SEAL","AGG. TREAT.","EMULS. ASPHALT TACK","EMULS. ASPHALT FOG SEAL"]
["AREA square feet",null,{"$f":"ROUND('Project&Typical Info'!P47,2)","v":0},{"$f":"ROUND('Project&Typical Info'!Q47,2)","v":0},"square yards PER STATION",null,{"$f":"ROUND(B48,0)","v":0},{"$f":"ROUND('Project&Typical Info'!I47,0)","v":0},{"$f":"ROUND('Project&Typical Info'!J47,0)","v":0},{"$f":"ROUND(B48,0)","v":0}]
["cubic yards PER STATION",null,{"$f":"ROUND('Project&Typical Info'!C47,1)","v":0},{"$f":"ROUND('Project&Typical Info'!D47,1)","v":0},"tons PER STATION",{"$f":"ROUND('Project&Typical Info'!G47,2)","v":0},{"$f":"ROUND('Project&Typical Info'!H47,2)","v":0}]
["tons PER STATION",null,{"$f":"ROUND('Project&Typical Info'!E47,1)","v":0},null,"gallons PER STATION",null,null,null,{"$f":"ROUND('Project&Typical Info'!K47,0)","v":0},{"$f":"ROUND('Project&Typical Info'!L47,0)","v":0}]
["square yards PER STATION",{"$f":"ROUND('Project&Typical Info'!B47,0)","v":0}]
[]
["TYPICAL SECTION NO. 8 QUANTITIES"]
["UNIT","COVER","PLANT MIX","CR. AGG. COURSE","UNIT","ASPHALT CEMENT","SEAL","AGG. TREAT.","EMULS. ASPHALT TACK","EMULS. ASPHALT FOG SEAL"]
["AREA square feet",null,{"$f":"ROUND('Project&Typical Info'!P48,2)","v":0},{"$f":"ROUND('Project&Typical Info'!Q48,2)","v":0},"square yards PER STATION",null,{"$f":"ROUND(B55,0)","v":0},{"$f":"ROUND('Project&Typical Info'!I48,0)","v":0},{"$f":"ROUND('Project&Typical Info'!J48,0)","v":0},{"$f":"ROUND(B55,0)","v":0}]
["cubic yards PER STATION",null,{"$f":"ROUND('Project&Typical Info'!C48,1)","v":0},{"$f":"ROUND('Project&Typical Info'!D48,1)","v":0},"tons PER STATION",{"$f":"ROUND('Project&Typical Info'!G48,2)","v":0},{"$f":"ROUND('Project&Typical Info'!H48,2)","v":0}]
["tons PER STATION",null,{"$f":"ROUND('Project&Typical Info'!E48,1)","v":0},null,"gallons PER STATION",null,null,null,{"$f":"ROUND('Project&Typical Info'!K48,0)","v":0},{"$f":"ROUND('Project&Typical Info'!L48,0)","v":0}]
["square yards PER STATION",{"$f":"ROUND('Project&Typical Info'!B48,0)","v":0}]
[]
["TYPICAL SECTION NO. 9 QUANTITIES"]
["UNIT","COVER","PLANT MIX","CR. AGG. COURSE","UNIT","ASPHALT CEMENT","SEAL","AGG. TREAT.","EMULS. ASPHALT TACK","EMULS. ASPHALT FOG SEAL"]
["AREA square feet",null,{"$f":"ROUND('Project&Typical Info'!P49,2)","v":0},{"$f":"ROUND('Project&Typical Info'!Q49,2)","v":0},"square yards PER STATION",null,{"$f":"ROUND(B62,0)","v":0},{"$f":"ROUND('Project&Typical Info'!I49,0)","v":0},{"$f":"ROUND('Project&Typical Info'!J49,0)","v":0},{"$f":"ROUND(B62,0)","v":0}]
["cubic yards PER STATION",null,{"$f":"ROUND('Project&Typical Info'!C49,1)","v":0},{"$f":"ROUND('Project&Typical Info'!D49,1)","v":0},"tons PER STATION",{"$f":"ROUND('Project&Typical Info'!G49,2)","v":0},{"$f":"ROUND('Project&Typical Info'!H49,2)","v":0}]
["tons PER STATION",null,{"$f":"ROUND('Project&Typical Info'!E49,1)","v":0},null,"gallons PER STATION",null,null,null,{"$f":"ROUND('Project&Typical Info'!K49,0)","v":0},{"$f":"ROUND('Project&Typical Info'!L49,0)","v":0}]
["square yards PER STATION",{"$f":"ROUND('Project&Typical Info'!B49,0)","v":0}]
[]
["TYPICAL SECTION NO. 10 QUANTITIES"]
["UNIT","COVER","PLANT MIX","CR. AGG. COURSE","UNIT","ASPHALT CEMENT","SEAL","AGG. TREAT.","EMULS. ASPHALT TACK","EMULS. ASPHALT FOG SEAL"]
["AREA square feet",null,{"$f":"ROUND('Project&Typical Info'!P50,2)","v":0},{"$f":"ROUND('Project&Typical Info'!Q50,2)","v":0},"square yards PER STATION",null,{"$f":"ROUND(B69,0)","v":0},{"$f":"ROUND('Project&Typical Info'!I50,0)","v":0},{"$f":"ROUND('Project&Typical Info'!J50,0)","v":0},{"$f":"ROUND(B69,0)","v":0}]
["cubic yards PER STATION",null,{"$f":"ROUND('Project&Typical Info'!C50,1)","v":0},{"$f":"ROUND('Project&Typical Info'!D50,1)","v":0},"tons PER STATION",{"$f":"ROUND('Project&Typical Info'!G50,2)","v":0},{"$f":"ROUND('Project&Typical Info'!H50,2)","v":0}]
["tons PER STATION",null,{"$f":"ROUND('Project&Typical Info'!E50,1)","v":0},null,"gallons PER STATION",null,null,null,{"$f":"ROUND('Project&Typical Info'!K50,0)","v":0},{"$f":"ROUND('Project&Typical Info'!L50,0)","v":0}]
["square yards PER STATION",{"$f":"ROUND('Project&Typical Info'!B50,0)","v":0}]
[]
["TYPICAL SECTION NO. 11 QUANTITIES"]
["UNIT","COVER","PLANT MIX","CR. AGG. COURSE","UNIT","ASPHALT CEMENT","SEAL","AGG. TREAT.","EMULS. ASPHALT TACK","EMULS. ASPHALT FOG SEAL"]
["AREA square feet",null,{"$f":"ROUND('Project&Typical Info'!P51,2)","v":0},{"$f":"ROUND('Project&Typical Info'!Q51,2)","v":0},"square yards PER STATION",null,{"$f":"ROUND(B76,0)","v":0},{"$f":"ROUND('Project&Typical Info'!I51,0)","v":0},{"$f":"ROUND('Project&Typical Info'!J51,0)","v":0},{"$f":"ROUND(B76,0)","v":0}]
["cubic yards PER STATION",null,{"$f":"ROUND('Project&Typical Info'!C51,1)","v":0},{"$f":"ROUND('Project&Typical Info'!D51,1)","v":0},"tons PER STATION",{"$f":"ROUND('Project&Typical Info'!G51,2)","v":0},{"$f":"ROUND('Project&Typical Info'!H51,2)","v":0}]
["tons PER STATION",null,{"$f":"ROUND('Project&Typical Info'!E51,1)","v":0},null,"gallons PER STATION",null,null,null,{"$f":"ROUND('Project&Typical Info'!K51,0)","v":0},{"$f":"ROUND('Project&Typical Info'!L51,0)","v":0}]
["square yards PER STATION",{"$f":"ROUND('Project&Typical Info'!B51,0)","v":0}]
[]
["TYPICAL SECTION NO. 12 QUANTITIES"]
["UNIT","COVER","PLANT MIX","CR. AGG. COURSE","UNIT","ASPHALT CEMENT","SEAL","AGG. TREAT.","EMULS. ASPHALT TACK","EMULS. ASPHALT FOG SEAL"]
["AREA square feet",null,{"$f":"ROUND('Project&Typical Info'!P52,2)","v":0},{"$f":"ROUND('Project&Typical Info'!Q52,2)","v":0},"square yards PER STATION",null,{"$f":"ROUND(B83,0)","v":0},{"$f":"ROUND('Project&Typical Info'!I52,0)","v":0},{"$f":"ROUND('Project&Typical Info'!J52,0)","v":0},{"$f":"ROUND(B83,0)","v":0}]
["cubic yards PER STATION",null,{"$f":"ROUND('Project&Typical Info'!C52,1)","v":0},{"$f":"ROUND('Project&Typical Info'!D52,1)","v":0},"tons PER STATION",{"$f":"ROUND('Project&Typical Info'!G52,2)","v":0},{"$f":"ROUND('Project&Typical Info'!H52,2)","v":0}]
["tons PER STATION",null,{"$f":"ROUND('Project&Typical Info'!E52,1)","v":0},null,"gallons PER STATION",null,null,null,{"$f":"ROUND('Project&Typical Info'!K52,0)","v":0},{"$f":"ROUND('Project&Typical Info'!L52,0)","v":0}]
["square yards PER STATION",{"$f":"ROUND('Project&Typical Info'!B52,0)","v":0}]
[]
["TYPICAL SECTION NO. 13 QUANTITIES"]
["UNIT","COVER","PLANT MIX","CR. AGG. COURSE","UNIT","ASPHALT CEMENT","SEAL","AGG. TREAT.","EMULS. ASPHALT TACK","EMULS. ASPHALT FOG SEAL"]
["AREA square feet",null,{"$f":"ROUND('Project&Typical Info'!P53,2)","v":0},{"$f":"ROUND('Project&Typical Info'!Q53,2)","v":0},"square yards PER STATION",null,{"$f":"ROUND(B90,0)","v":0},{"$f":"ROUND('Project&Typical Info'!I53,0)","v":0},{"$f":"ROUND('Project&Typical Info'!J53,0)","v":0},{"$f":"ROUND(B90,0)","v":0}]
["cubic yards PER STATION",null,{"$f":"ROUND('Project&Typical Info'!C53,1)","v":0},{"$f":"ROUND('Project&Typical Info'!D53,1)","v":0},"tons PER STATION",{"$f":"ROUND('Project&Typical Info'!G53,2)","v":0},{"$f":"ROUND('Project&Typical Info'!H53,2)","v":0}]
["tons PER STATION",null,{"$f":"ROUND('Project&Typical Info'!E53,1)","v":0},null,"gallons PER STATION",null,null,null,{"$f":"ROUND('Project&Typical Info'!K53,0)","v":0},{"$f":"ROUND('Project&Typical Info'!L53,0)","v":0}]
["square yards PER STATION",{"$f":"ROUND('Project&Typical Info'!B53,0)","v":0}]
[]
["TYPICAL SECTION NO. 14 QUANTITIES"]
["UNIT","COVER","PLANT MIX","CR. AGG. COURSE","UNIT","ASPHALT CEMENT","SEAL","AGG. TREAT.","EMULS. ASPHALT TACK","EMULS. ASPHALT FOG SEAL"]
["AREA square feet",null,{"$f":"ROUND('Project&Typical Info'!P54,2)","v":0},{"$f":"ROUND('Project&Typical Info'!Q54,2)","v":0},"square yards PER STATION",null,{"$f":"ROUND(B97,0)","v":0},{"$f":"ROUND('Project&Typical Info'!I54,0)","v":0},{"$f":"ROUND('Project&Typical Info'!J54,0)","v":0},{"$f":"ROUND(B97,0)","v":0}]
["cubic yards PER STATION",null,{"$f":"ROUND('Project&Typical Info'!C54,1)","v":0},{"$f":"ROUND('Project&Typical Info'!D54,1)","v":0},"tons PER STATION",{"$f":"ROUND('Project&Typical Info'!G54,2)","v":0},{"$f":"ROUND('Project&Typical Info'!H54,2)","v":0}]
["tons PER STATION",null,{"$f":"ROUND('Project&Typical Info'!E54,1)","v":0},null,"gallons PER STATION",null,null,null,{"$f":"ROUND('Project&Typical Info'!K54,0)","v":0},{"$f":"ROUND('Project&Typical Info'!L54,0)","v":0}]
["square yards PER STATION",{"$f":"ROUND('Project&Typical Info'!B54,0)","v":0}]
[]
["TYPICAL SECTION NO. 15 QUANTITIES"]
["UNIT","COVER","PLANT MIX","CR. AGG. COURSE","UNIT","ASPHALT CEMENT","SEAL","AGG. TREAT.","EMULS. ASPHALT TACK","EMULS. ASPHALT FOG SEAL"]
["AREA square feet",null,{"$f":"ROUND('Project&Typical Info'!P55,2)","v":0},{"$f":"ROUND('Project&Typical Info'!Q55,2)","v":0},"square yards PER STATION",null,{"$f":"ROUND(B104,0)","v":0},{"$f":"ROUND('Project&Typical Info'!I55,0)","v":0},{"$f":"ROUND('Project&Typical Info'!J55,0)","v":0},{"$f":"ROUND(B104,0)","v":0}]
["cubic yards PER STATION",null,{"$f":"ROUND('Project&Typical Info'!C55,1)","v":0},{"$f":"ROUND('Project&Typical Info'!D55,1)","v":0},"tons PER STATION",{"$f":"ROUND('Project&Typical Info'!G55,2)","v":0},{"$f":"ROUND('Project&Typical Info'!H55,2)","v":0}]
["tons PER STATION",null,{"$f":"ROUND('Project&Typical Info'!E55,1)","v":0},null,"gallons PER STATION",null,null,null,{"$f":"ROUND('Project&Typical Info'!K55,0)","v":0},{"$f":"ROUND('Project&Typical Info'!L55,0)","v":0}]
["square yards PER STATION",{"$f":"ROUND('Project&Typical Info'!B55,0)","v":0}]
[]
["TYPICAL SECTION NO. 16 QUANTITIES"]
["UNIT","COVER","PLANT MIX","CR. AGG. COURSE","UNIT","ASPHALT CEMENT","SEAL","AGG. TREAT.","EMULS. ASPHALT TACK","EMULS. ASPHALT FOG SEAL"]
["AREA square feet",null,{"$f":"ROUND('Project&Typical Info'!P56,2)","v":0},{"$f":"ROUND('Project&Typical Info'!Q56,2)","v":0},"square yards PER STATION",null,{"$f":"ROUND(B111,0)","v":0},{"$f":"ROUND('Project&Typical Info'!I56,0)","v":0},{"$f":"ROUND('Project&Typical Info'!J56,0)","v":0},{"$f":"ROUND(B111,0)","v":0}]
["cubic yards PER STATION",null,{"$f":"ROUND('Project&Typical Info'!C56,1)","v":0},{"$f":"ROUND('Project&Typical Info'!D56,1)","v":0},"tons PER STATION",{"$f":"ROUND('Project&Typical Info'!G56,2)","v":0},{"$f":"ROUND('Project&Typical Info'!H56,2)","v":0}]
["tons PER STATION",null,{"$f":"ROUND('Project&Typical Info'!E56,1)","v":0},null,"gallons PER STATION",null,null,null,{"$f":"ROUND('Project&Typical Info'!K56,0)","v":0},{"$f":"ROUND('Project&Typical Info'!L56,0)","v":0}]
["square yards PER STATION",{"$f":"ROUND('Project&Typical Info'!B56,0)","v":0}]
[]
["TYPICAL SECTION NO. 17 QUANTITIES"]
["UNIT","COVER","PLANT MIX","CR. AGG. COURSE","UNIT","ASPHALT CEMENT","SEAL","AGG. TREAT.","EMULS. ASPHALT TACK","EMULS. ASPHALT FOG SEAL"]
["AREA square feet",null,{"$f":"ROUND('Project&Typical Info'!P57,2)","v":0},{"$f":"ROUND('Project&Typical Info'!Q57,2)","v":0},"square yards PER STATION",null,{"$f":"ROUND(B118,0)","v":0},{"$f":"ROUND('Project&Typical Info'!I57,0)","v":0},{"$f":"ROUND('Project&Typical Info'!J57,0)","v":0},{"$f":"ROUND(B118,0)","v":0}]
["cubic yards PER STATION",null,{"$f":"ROUND('Project&Typical Info'!C57,1)","v":0},{"$f":"ROUND('Project&Typical Info'!D57,1)","v":0},"tons PER STATION",{"$f":"ROUND('Project&Typical Info'!G57,2)","v":0},{"$f":"ROUND('Project&Typical Info'!H57,2)","v":0}]
["tons PER STATION",null,{"$f":"ROUND('Project&Typical Info'!E57,1)","v":0},null,"gallons PER STATION",null,null,null,{"$f":"ROUND('Project&Typical Info'!K57,0)","v":0},{"$f":"ROUND('Project&Typical Info'!L57,0)","v":0}]
["square yards PER STATION",{"$f":"ROUND('Project&Typical Info'!B57,0)","v":0}]
[]
["TYPICAL SECTION NO. 18 QUANTITIES"]
["UNIT","COVER","PLANT MIX","CR. AGG. COURSE","UNIT","ASPHALT CEMENT","SEAL","AGG. TREAT.","EMULS. ASPHALT TACK","EMULS. ASPHALT FOG SEAL"]
["AREA square feet",null,{"$f":"ROUND('Project&Typical Info'!P58,2)","v":0},{"$f":"ROUND('Project&Typical Info'!Q58,2)","v":0},"square yards PER STATION",null,{"$f":"ROUND(B125,0)","v":0},{"$f":"ROUND('Project&Typical Info'!I58,0)","v":0},{"$f":"ROUND('Project&Typical Info'!J58,0)","v":0},{"$f":"ROUND(B125,0)","v":0}]
["cubic yards PER STATION",null,{"$f":"ROUND('Project&Typical Info'!C58,1)","v":0},{"$f":"ROUND('Project&Typical Info'!D58,1)","v":0},"tons PER STATION",{"$f":"ROUND('Project&Typical Info'!G58,2)","v":0},{"$f":"ROUND('Project&Typical Info'!H58,2)","v":0}]
["tons PER STATION",null,{"$f":"ROUND('Project&Typical Info'!E58,1)","v":0},null,"gallons PER STATION",null,null,null,{"$f":"ROUND('Project&Typical Info'!K58,0)","v":0},{"$f":"ROUND('Project&Typical Info'!L58,0)","v":0}]
["square yards PER STATION",{"$f":"ROUND('Project&Typical Info'!B58,0)","v":0}]
[]
["TYPICAL SECTION NO. 19 QUANTITIES"]
["UNIT","COVER","PLANT MIX","CR. AGG. COURSE","UNIT","ASPHALT CEMENT","SEAL","AGG. TREAT.","EMULS. ASPHALT TACK","EMULS. ASPHALT FOG SEAL"]
["AREA square feet",null,{"$f":"ROUND('Project&Typical Info'!P59,2)","v":0},{"$f":"ROUND('Project&Typical Info'!Q59,2)","v":0},"square yards PER STATION",null,{"$f":"ROUND(B132,0)","v":0},{"$f":"ROUND('Project&Typical Info'!I59,0)","v":0},{"$f":"ROUND('Project&Typical Info'!J59,0)","v":0},{"$f":"ROUND(B132,0)","v":0}]
["cubic yards PER STATION",null,{"$f":"ROUND('Project&Typical Info'!C59,1)","v":0},{"$f":"ROUND('Project&Typical Info'!D59,1)","v":0},"tons PER STATION",{"$f":"ROUND('Project&Typical Info'!G59,2)","v":0},{"$f":"ROUND('Project&Typical Info'!H59,2)","v":0}]
["tons PER STATION",null,{"$f":"ROUND('Project&Typical Info'!E59,1)","v":0},null,"gallons PER STATION",null,null,null,{"$f":"ROUND('Project&Typical Info'!K59,0)","v":0},{"$f":"ROUND('Project&Typical Info'!L59,0)","v":0}]
["square yards PER STATION",{"$f":"ROUND('Project&Typical Info'!B59,0)","v":0}]
[]
["TYPICAL SECTION NO. 20 QUANTITIES"]
["UNIT","COVER","PLANT MIX","CR. AGG. COURSE","UNIT","ASPHALT CEMENT","SEAL","AGG. TREAT.","EMULS. ASPHALT TACK","EMULS. ASPHALT FOG SEAL"]
["AREA square feet",null,{"$f":"ROUND('Project&Typical Info'!P60,2)","v":0},{"$f":"ROUND('Project&Typical Info'!Q60,2)","v":0},"square yards PER STATION",null,{"$f":"ROUND(B139,0)","v":0},{"$f":"ROUND('Project&Typical Info'!I60,0)","v":0},{"$f":"ROUND('Project&Typical Info'!J60,0)","v":0},{"$f":"ROUND(B139,0)","v":0}]
["cubic yards PER STATION",null,{"$f":"ROUND('Project&Typical Info'!C60,1)","v":0},{"$f":"ROUND('Project&Typical Info'!D60,1)","v":0},"tons PER STATION",{"$f":"ROUND('Project&Typical Info'!G60,2)","v":0},{"$f":"ROUND('Project&Typical Info'!H60,2)","v":0}]
["tons PER STATION",null,{"$f":"ROUND('Project&Typical Info'!E60,1)","v":0},null,"gallons PER STATION",null,null,null,{"$f":"ROUND('Project&Typical Info'!K60,0)","v":0},{"$f":"ROUND('Project&Typical Info'!L60,0)","v":0}]
["square yards PER STATION",{"$f":"ROUND('Project&Typical Info'!B60,0)","v":0}]

{"sheet":"Lookup Values","index":4,"n_rows":402,"n_cols":13,"rows_kept":402,"cut":false,"hidden":true,"merged":[]}
[1,"REMARKS","COVER\nyd2/STA","PLANT MIX\nT/STA","CRUSHED AGG. COURSE\nyd3/STA","SPECIAL BORROW","TRAFFIC GRAVEL","SHOULDER GRAVEL","ASPHALT CEMENT\nT/STA","SEAL\nT/STA","AGG. TREAT.\nyd2/STA","EMULS. ASPHALT TACK\ngal/STA","EMULS. ASPHALT FOG SEAL\ngal/STA"]
[2,"TYP. NO. 1",{"$f":"'Typical Section Quantities'!B6","v":356},{"$f":"'Typical Section Quantities'!C5","v":72.900000000000006},{"$f":"'Typical Section Quantities'!D4","v":131.6},null,null,null,{"$f":"'Typical Section Quantities'!F4","v":3.94},{"$f":"'Typical Section Quantities'!G4","v":0.64},{"$f":"'Typical Section Quantities'!H3","v":400},{"$f":"'Typical Section Quantities'!I5","v":40},{"$f":"'Typical Section Quantities'!J5","v":27}]
[3,"TYP. NO. 2",{"$f":"'Typical Section Quantities'!B13","v":356},{"$f":"'Typical Section Quantities'!C12","v":72.7},{"$f":"'Typical Section Quantities'!D11","v":127.3},null,null,null,{"$f":"'Typical Section Quantities'!F11","v":3.93},{"$f":"'Typical Section Quantities'!G11","v":0.64},{"$f":"'Typical Section Quantities'!H10","v":399},{"$f":"'Typical Section Quantities'!I12","v":40},{"$f":"'Typical Section Quantities'!J12","v":27}]
[4,"TYP. NO. 3",{"$f":"'Typical Section Quantities'!B20","v":0},{"$f":"'Typical Section Quantities'!C19","v":0},{"$f":"'Typical Section Quantities'!D18","v":0},null,null,null,{"$f":"'Typical Section Quantities'!F18","v":0},{"$f":"'Typical Section Quantities'!G18","v":0},{"$f":"'Typical Section Quantities'!H17","v":0},{"$f":"'Typical Section Quantities'!I19","v":0},{"$f":"'Typical Section Quantities'!J19","v":0}]
[5,"TYP. NO. 4",{"$f":"'Typical Section Quantities'!B27","v":0},{"$f":"'Typical Section Quantities'!C26","v":0},{"$f":"'Typical Section Quantities'!D25","v":0},null,null,null,{"$f":"'Typical Section Quantities'!F25","v":0},{"$f":"'Typical Section Quantities'!G25","v":0},{"$f":"'Typical Section Quantities'!H24","v":0},{"$f":"'Typical Section Quantities'!I26","v":0},{"$f":"'Typical Section Quantities'!J26","v":0}]
[6,"TYP. NO. 5",{"$f":"'Typical Section Quantities'!B34","v":0},{"$f":"'Typical Section Quantities'!C33","v":0},{"$f":"'Typical Section Quantities'!D32","v":0},null,null,null,{"$f":"'Typical Section Quantities'!F32","v":0},{"$f":"'Typical Section Quantities'!G32","v":0},{"$f":"'Typical Section Quantities'!H31","v":0},{"$f":"'Typical Section Quantities'!I33","v":0},{"$f":"'Typical Section Quantities'!J33","v":0}]
[7,"TYP. NO. 6",{"$f":"'Typical Section Quantities'!B41","v":0},{"$f":"'Typical Section Quantities'!C40","v":0},{"$f":"'Typical Section Quantities'!D39","v":0},null,null,null,{"$f":"'Typical Section Quantities'!F39","v":0},{"$f":"'Typical Section Quantities'!G39","v":0},{"$f":"'Typical Section Quantities'!H38","v":0},{"$f":"'Typical Section Quantities'!I40","v":0},{"$f":"'Typical Section Quantities'!J40","v":0}]
[8,"TYP. NO. 7",{"$f":"'Typical Section Quantities'!B48","v":0},{"$f":"'Typical Section Quantities'!C47","v":0},{"$f":"'Typical Section Quantities'!D46","v":0},null,null,null,{"$f":"'Typical Section Quantities'!F46","v":0},{"$f":"'Typical Section Quantities'!G46","v":0},{"$f":"'Typical Section Quantities'!H45","v":0},{"$f":"'Typical Section Quantities'!I47","v":0},{"$f":"'Typical Section Quantities'!J47","v":0}]
[9,"TYP. NO. 8",{"$f":"'Typical Section Quantities'!B55","v":0},{"$f":"'Typical Section Quantities'!C54","v":0},{"$f":"'Typical Section Quantities'!D53","v":0},null,null,null,{"$f":"'Typical Section Quantities'!F53","v":0},{"$f":"'Typical Section Quantities'!G53","v":0},{"$f":"'Typical Section Quantities'!H52","v":0},{"$f":"'Typical Section Quantities'!I54","v":0},{"$f":"'Typical Section Quantities'!J54","v":0}]
[10,"TYP. NO. 9",{"$f":"'Typical Section Quantities'!B62","v":0},{"$f":"'Typical Section Quantities'!C61","v":0},{"$f":"'Typical Section Quantities'!D60","v":0},null,null,null,{"$f":"'Typical Section Quantities'!F60","v":0},{"$f":"'Typical Section Quantities'!G60","v":0},{"$f":"'Typical Section Quantities'!H59","v":0},{"$f":"'Typical Section Quantities'!I61","v":0},{"$f":"'Typical Section Quantities'!J61","v":0}]
[11,"TYP. NO. 10",{"$f":"'Typical Section Quantities'!B69","v":0},{"$f":"'Typical Section Quantities'!C68","v":0},{"$f":"'Typical Section Quantities'!D67","v":0},null,null,null,{"$f":"'Typical Section Quantities'!F67","v":0},{"$f":"'Typical Section Quantities'!G67","v":0},{"$f":"'Typical Section Quantities'!H66","v":0},{"$f":"'Typical Section Quantities'!I68","v":0},{"$f":"'Typical Section Quantities'!J68","v":0}]
[12,"TYP. NO. 11",{"$f":"'Typical Section Quantities'!B76","v":0},{"$f":"'Typical Section Quantities'!C75","v":0},{"$f":"'Typical Section Quantities'!D74","v":0},null,null,null,{"$f":"'Typical Section Quantities'!F74","v":0},{"$f":"'Typical Section Quantities'!G74","v":0},{"$f":"'Typical Section Quantities'!H73","v":0},{"$f":"'Typical Section Quantities'!I75","v":0},{"$f":"'Typical Section Quantities'!J75","v":0}]
[13,"TYP. NO. 12",{"$f":"'Typical Section Quantities'!B83","v":0},{"$f":"'Typical Section Quantities'!C82","v":0},{"$f":"'Typical Section Quantities'!D81","v":0},null,null,null,{"$f":"'Typical Section Quantities'!F81","v":0},{"$f":"'Typical Section Quantities'!G81","v":0},{"$f":"'Typical Section Quantities'!H80","v":0},{"$f":"'Typical Section Quantities'!I82","v":0},{"$f":"'Typical Section Quantities'!J82","v":0}]
[14,"TYP. NO. 13",{"$f":"'Typical Section Quantities'!B90","v":0},{"$f":"'Typical Section Quantities'!C89","v":0},{"$f":"'Typical Section Quantities'!D88","v":0},null,null,null,{"$f":"'Typical Section Quantities'!F88","v":0},{"$f":"'Typical Section Quantities'!G88","v":0},{"$f":"'Typical Section Quantities'!H87","v":0},{"$f":"'Typical Section Quantities'!I89","v":0},{"$f":"'Typical Section Quantities'!J89","v":0}]
[15,"TYP. NO. 14",{"$f":"'Typical Section Quantities'!B97","v":0},{"$f":"'Typical Section Quantities'!C96","v":0},{"$f":"'Typical Section Quantities'!D95","v":0},null,null,null,{"$f":"'Typical Section Quantities'!F95","v":0},{"$f":"'Typical Section Quantities'!G95","v":0},{"$f":"'Typical Section Quantities'!H94","v":0},{"$f":"'Typical Section Quantities'!I96","v":0},{"$f":"'Typical Section Quantities'!J96","v":0}]
[16,"TYP. NO. 15",{"$f":"'Typical Section Quantities'!B104","v":0},{"$f":"'Typical Section Quantities'!C103","v":0},{"$f":"'Typical Section Quantities'!D102","v":0},null,null,null,{"$f":"'Typical Section Quantities'!F102","v":0},{"$f":"'Typical Section Quantities'!G102","v":0},{"$f":"'Typical Section Quantities'!H101","v":0},{"$f":"'Typical Section Quantities'!I103","v":0},{"$f":"'Typical Section Quantities'!J103","v":0}]
[17,"TYP. NO. 16",{"$f":"'Typical Section Quantities'!B111","v":0},{"$f":"'Typical Section Quantities'!C110","v":0},{"$f":"'Typical Section Quantities'!D109","v":0},null,null,null,{"$f":"'Typical Section Quantities'!F109","v":0},{"$f":"'Typical Section Quantities'!G109","v":0},{"$f":"'Typical Section Quantities'!H108","v":0},{"$f":"'Typical Section Quantities'!I110","v":0},{"$f":"'Typical Section Quantities'!J110","v":0}]
[18,"TYP. NO. 17",{"$f":"'Typical Section Quantities'!B118","v":0},{"$f":"'Typical Section Quantities'!C117","v":0},{"$f":"'Typical Section Quantities'!D116","v":0},null,null,null,{"$f":"'Typical Section Quantities'!F116","v":0},{"$f":"'Typical Section Quantities'!G116","v":0},{"$f":"'Typical Section Quantities'!H115","v":0},{"$f":"'Typical Section Quantities'!I117","v":0},{"$f":"'Typical Section Quantities'!J117","v":0}]
[19,"TYP. NO. 18",{"$f":"'Typical Section Quantities'!B125","v":0},{"$f":"'Typical Section Quantities'!C124","v":0},{"$f":"'Typical Section Quantities'!D123","v":0},null,null,null,{"$f":"'Typical Section Quantities'!F123","v":0},{"$f":"'Typical Section Quantities'!G123","v":0},{"$f":"'Typical Section Quantities'!H122","v":0},{"$f":"'Typical Section Quantities'!I124","v":0},{"$f":"'Typical Section Quantities'!J124","v":0}]
[20,"TYP. NO. 19",{"$f":"'Typical Section Quantities'!B132","v":0},{"$f":"'Typical Section Quantities'!C131","v":0},{"$f":"'Typical Section Quantities'!D130","v":0},null,null,null,{"$f":"'Typical Section Quantities'!F130","v":0},{"$f":"'Typical Section Quantities'!G130","v":0},{"$f":"'Typical Section Quantities'!H129","v":0},{"$f":"'Typical Section Quantities'!I131","v":0},{"$f":"'Typical Section Quantities'!J131","v":0}]
[21,"TYP. NO. 20",{"$f":"'Typical Section Quantities'!B139","v":0},{"$f":"'Typical Section Quantities'!C138","v":0},{"$f":"'Typical Section Quantities'!D137","v":0},null,null,null,{"$f":"'Typical Section Quantities'!F137","v":0},{"$f":"'Typical Section Quantities'!G137","v":0},{"$f":"'Typical Section Quantities'!H136","v":0},{"$f":"'Typical Section Quantities'!I138","v":0},{"$f":"'Typical Section Quantities'!J138","v":0}]
[22,"TRANS. TYP. NO. 1 TO TYP. NO. 2",{"$f":"(C$2+C3)/2","v":356},{"$f":"(D$2+D3)/2","v":72.800000000000011},129.44999999999999,null,null,null,3.9350000000000001,0.64,{"$f":"(K$2+K3)/2","v":399.5},40,27]
[23,"TRANS. TYP. NO. 1 TO TYP. NO. 3",{"$f":"(C$2+C4)/2","v":178},36.450000000000003,65.8,null,null,null,1.97,0.32,200,20,13.5]
[24,"TRANS. TYP. NO. 1 TO TYP. NO. 4",{"$f":"(C$2+C5)/2","v":178},36.450000000000003,65.8,null,null,null,1.97,0.32,200,20,13.5]
[25,"TRANS. TYP. NO. 1 TO TYP. NO. 5",{"$f":"(C$2+C6)/2","v":178},36.450000000000003,65.8,null,null,null,1.97,0.32,200,20,13.5]
[26,"TRANS. TYP. NO. 1 TO TYP. NO. 6",{"$f":"(C$2+C7)/2","v":178},36.450000000000003,65.8,null,null,null,1.97,0.32,200,20,13.5]
[27,"TRANS. TYP. NO. 1 TO TYP. NO. 7",{"$f":"(C$2+C8)/2","v":178},36.450000000000003,65.8,null,null,null,1.97,0.32,200,20,13.5]
[28,"TRANS. TYP. NO. 1 TO TYP. NO. 8",{"$f":"(C$2+C9)/2","v":178},36.450000000000003,65.8,null,null,null,1.97,0.32,200,20,13.5]
[29,"TRANS. TYP. NO. 1 TO TYP. NO. 9",{"$f":"(C$2+C10)/2","v":178},36.450000000000003,65.8,null,null,null,1.97,0.32,200,20,13.5]
[30,"TRANS. TYP. NO. 1 TO TYP. NO. 10",{"$f":"(C$2+C11)/2","v":178},36.450000000000003,65.8,null,null,null,1.97,0.32,200,20,13.5]
[31,"TRANS. TYP. NO. 1 TO TYP. NO. 11",{"$f":"(C$2+C12)/2","v":178},36.450000000000003,65.8,null,null,null,1.97,0.32,200,20,13.5]
[32,"TRANS. TYP. NO. 1 TO TYP. NO. 12",{"$f":"(C$2+C13)/2","v":178},36.450000000000003,65.8,null,null,null,1.97,0.32,200,20,13.5]
[33,"TRANS. TYP. NO. 1 TO TYP. NO. 13",{"$f":"(C$2+C14)/2","v":178},36.450000000000003,65.8,null,null,null,1.97,0.32,200,20,13.5]
[34,"TRANS. TYP. NO. 1 TO TYP. NO. 14",{"$f":"(C$2+C15)/2","v":178},36.450000000000003,65.8,null,null,null,1.97,0.32,200,20,13.5]
[35,"TRANS. TYP. NO. 1 TO TYP. NO. 15",{"$f":"(C$2+C16)/2","v":178},36.450000000000003,65.8,null,null,null,1.97,0.32,200,20,13.5]
[36,"TRANS. TYP. NO. 1 TO TYP. NO. 16",{"$f":"(C$2+C17)/2","v":178},36.450000000000003,65.8,null,null,null,1.97,0.32,200,20,13.5]
[37,"TRANS. TYP. NO. 1 TO TYP. NO. 17",{"$f":"(C$2+C18)/2","v":178},36.450000000000003,65.8,null,null,null,1.97,0.32,200,20,13.5]
[38,"TRANS. TYP. NO. 1 TO TYP. NO. 18",{"$f":"(C$2+C19)/2","v":178},36.450000000000003,65.8,null,null,null,1.97,0.32,200,20,13.5]
[39,"TRANS. TYP. NO. 1 TO TYP. NO. 19",{"$f":"(C$2+C20)/2","v":178},36.450000000000003,65.8,null,null,null,1.97,0.32,200,20,13.5]
[40,"TRANS. TYP. NO. 1 TO TYP. NO. 20",{"$f":"(C$2+C21)/2","v":178},36.450000000000003,65.8,null,null,null,1.97,0.32,200,20,13.5]
[41,"TRANS. TYP. NO. 2 TO TYP. NO. 1",{"$f":"(C$3+C2)/2","v":356},{"$f":"(D$3+D2)/2","v":72.800000000000011},129.44999999999999,null,null,null,3.9350000000000001,0.64,{"$f":"(K$3+K2)/2","v":399.5},{"$f":"(L$3+L2)/2","v":40},{"$f":"(M$3+M2)/2","v":27}]
[42,"TRANS. TYP. NO. 2 TO TYP. NO. 3",{"$f":"(C$3+C4)/2","v":178},{"$f":"(D$3+D4)/2","v":36.35},63.65,null,null,null,1.9650000000000001,0.32,{"$f":"(K$3+K4)/2","v":199.5},20,13.5]
[43,"TRANS. TYP. NO. 2 TO TYP. NO. 4",{"$f":"(C$3+C5)/2","v":178},36.35,63.65,null,null,null,1.9650000000000001,0.32,199.5,20,13.5]
[44,"TRANS. TYP. NO. 2 TO TYP. NO. 5",{"$f":"(C$3+C6)/2","v":178},36.35,63.65,null,null,null,1.9650000000000001,0.32,199.5,20,13.5]
[45,"TRANS. TYP. NO. 2 TO TYP. NO. 6",{"$f":"(C$3+C7)/2","v":178},36.35,63.65,null,null,null,1.9650000000000001,0.32,199.5,20,13.5]
[46,"TRANS. TYP. NO. 2 TO TYP. NO. 7",{"$f":"(C$3+C8)/2","v":178},36.35,63.65,null,null,null,1.9650000000000001,0.32,199.5,20,13.5]
[47,"TRANS. TYP. NO. 2 TO TYP. NO. 8",{"$f":"(C$3+C9)/2","v":178},36.35,63.65,null,null,null,1.9650000000000001,0.32,199.5,20,13.5]
[48,"TRANS. TYP. NO. 2 TO TYP. NO. 9",{"$f":"(C$3+C10)/2","v":178},36.35,63.65,null,null,null,1.9650000000000001,0.32,199.5,20,13.5]
[49,"TRANS. TYP. NO. 2 TO TYP. NO. 10",{"$f":"(C$3+C11)/2","v":178},36.35,63.65,null,null,null,1.9650000000000001,0.32,199.5,20,13.5]
[50,"TRANS. TYP. NO. 2 TO TYP. NO. 11",{"$f":"(C$3+C12)/2","v":178},36.35,63.65,null,null,null,1.9650000000000001,0.32,199.5,20,13.5]
[51,"TRANS. TYP. NO. 2 TO TYP. NO. 12",{"$f":"(C$3+C13)/2","v":178},36.35,63.65,null,null,null,1.9650000000000001,0.32,199.5,20,13.5]
[52,"TRANS. TYP. NO. 2 TO TYP. NO. 13",{"$f":"(C$3+C14)/2","v":178},36.35,63.65,null,null,null,1.9650000000000001,0.32,199.5,20,13.5]
[53,"TRANS. TYP. NO. 2 TO TYP. NO. 14",{"$f":"(C$3+C15)/2","v":178},36.35,63.65,null,null,null,1.9650000000000001,0.32,199.5,20,13.5]
[54,"TRANS. TYP. NO. 2 TO TYP. NO. 15",{"$f":"(C$3+C16)/2","v":178},36.35,63.65,null,null,null,1.9650000000000001,0.32,199.5,20,13.5]
[55,"TRANS. TYP. NO. 2 TO TYP. NO. 16",{"$f":"(C$3+C17)/2","v":178},36.35,63.65,null,null,null,1.9650000000000001,0.32,199.5,20,13.5]
[56,"TRANS. TYP. NO. 2 TO TYP. NO. 17",{"$f":"(C$3+C18)/2","v":178},36.35,63.65,null,null,null,1.9650000000000001,0.32,199.5,20,13.5]
[57,"TRANS. TYP. NO. 2 TO TYP. NO. 18",{"$f":"(C$3+C19)/2","v":178},36.35,63.65,null,null,null,1.9650000000000001,0.32,199.5,20,13.5]
[58,"TRANS. TYP. NO. 2 TO TYP. NO. 19",{"$f":"(C$3+C20)/2","v":178},36.35,63.65,null,null,null,1.9650000000000001,0.32,199.5,20,13.5]
[59,"TRANS. TYP. NO. 2 TO TYP. NO. 20",{"$f":"(C$3+C21)/2","v":178},36.35,63.65,null,null,null,1.9650000000000001,0.32,199.5,20,13.5]
[60,"TRANS. TYP. NO. 3 TO TYP. NO. 1",{"$f":"(C$4+C2)/2","v":178},{"$f":"(D$4+D2)/2","v":36.450000000000003},65.8,null,null,null,1.97,0.32,{"$f":"(K$4+K2)/2","v":200},20,13.5]
[61,"TRANS. TYP. NO. 3 TO TYP. NO. 2",{"$f":"(C$4+C3)/2","v":178},{"$f":"(D$4+D3)/2","v":36.35},63.65,null,null,null,1.9650000000000001,0.32,199.5,20,13.5]
[62,"TRANS. TYP. NO. 3 TO TYP. NO. 4",{"$f":"(C$4+C5)/2","v":0},{"$f":"(D$4+D5)/2","v":0},0,null,null,null,0,0,{"$f":"(K$4+K5)/2","v":0},0,0]
[63,"TRANS. TYP. NO. 3 TO TYP. NO. 5",{"$f":"(C$4+C6)/2","v":0},{"$f":"(D$4+D6)/2","v":0},0,null,null,null,0,0,0,0,0]
[64,"TRANS. TYP. NO. 3 TO TYP. NO. 6",{"$f":"(C$4+C7)/2","v":0},{"$f":"(D$4+D7)/2","v":0},0,null,null,null,0,0,0,0,0]
[65,"TRANS. TYP. NO. 3 TO TYP. NO. 7",{"$f":"(C$4+C8)/2","v":0},{"$f":"(D$4+D8)/2","v":0},0,null,null,null,0,0,0,0,0]
[66,"TRANS. TYP. NO. 3 TO TYP. NO. 8",{"$f":"(C$4+C9)/2","v":0},{"$f":"(D$4+D9)/2","v":0},0,null,null,null,0,0,0,0,0]
[67,"TRANS. TYP. NO. 3 TO TYP. NO. 9",{"$f":"(C$4+C10)/2","v":0},{"$f":"(D$4+D10)/2","v":0},0,null,null,null,0,0,0,0,0]
[68,"TRANS. TYP. NO. 3 TO TYP. NO. 10",{"$f":"(C$4+C11)/2","v":0},{"$f":"(D$4+D11)/2","v":0},0,null,null,null,0,0,0,0,0]
[69,"TRANS. TYP. NO. 3 TO TYP. NO. 11",{"$f":"(C$4+C12)/2","v":0},{"$f":"(D$4+D12)/2","v":0},0,null,null,null,0,0,0,0,0]
[70,"TRANS. TYP. NO. 3 TO TYP. NO. 12",{"$f":"(C$4+C13)/2","v":0},{"$f":"(D$4+D13)/2","v":0},0,null,null,null,0,0,0,0,0]
[71,"TRANS. TYP. NO. 3 TO TYP. NO. 13",{"$f":"(C$4+C14)/2","v":0},{"$f":"(D$4+D14)/2","v":0},0,null,null,null,0,0,0,0,0]
[72,"TRANS. TYP. NO. 3 TO TYP. NO. 14",{"$f":"(C$4+C15)/2","v":0},{"$f":"(D$4+D15)/2","v":0},0,null,null,null,0,0,0,0,0]
[73,"TRANS. TYP. NO. 3 TO TYP. NO. 15",{"$f":"(C$4+C16)/2","v":0},{"$f":"(D$4+D16)/2","v":0},0,null,null,null,0,0,0,0,0]
[74,"TRANS. TYP. NO. 3 TO TYP. NO. 16",{"$f":"(C$4+C17)/2","v":0},{"$f":"(D$4+D17)/2","v":0},0,null,null,null,0,0,0,0,0]
[75,"TRANS. TYP. NO. 3 TO TYP. NO. 17",{"$f":"(C$4+C18)/2","v":0},{"$f":"(D$4+D18)/2","v":0},0,null,null,null,0,0,0,0,0]
[76,"TRANS. TYP. NO. 3 TO TYP. NO. 18",{"$f":"(C$4+C19)/2","v":0},{"$f":"(D$4+D19)/2","v":0},0,null,null,null,0,0,0,0,0]
[77,"TRANS. TYP. NO. 3 TO TYP. NO. 19",{"$f":"(C$4+C20)/2","v":0},{"$f":"(D$4+D20)/2","v":0},0,null,null,null,0,0,0,0,0]
[78,"TRANS. TYP. NO. 3 TO TYP. NO. 20",{"$f":"(C$4+C21)/2","v":0},{"$f":"(D$4+D21)/2","v":0},0,null,null,null,0,0,0,0,0]
[79,"TRANS. TYP. NO. 4 TO TYP. NO. 1",{"$f":"(C$5+C2)/2","v":178},{"$f":"(D$5+D2)/2","v":36.450000000000003},65.8,null,null,null,1.97,0.32,{"$f":"(K$5+K2)/2","v":200},20,13.5]
[80,"TRANS. TYP. NO. 4 TO TYP. NO. 2",{"$f":"(C$5+C3)/2","v":178},{"$f":"(D$5+D3)/2","v":36.35},63.65,null,null,null,1.9650000000000001,0.32,199.5,20,13.5]
[81,"TRANS. TYP. NO. 4 TO TYP. NO. 3",0,{"$f":"(D$5+D4)/2","v":0},0,null,null,null,0,0,0,0,0]
[82,"TRANS. TYP. NO. 4 TO TYP. NO. 5",{"$f":"(C$5+C6)/2","v":0},{"$f":"(D$5+D6)/2","v":0},0,null,null,null,0,0,{"$f":"(K$5+K6)/2","v":0},0,0]
[83,"TRANS. TYP. NO. 4 TO TYP. NO. 6",{"$f":"(C$5+C7)/2","v":0},0,0,null,null,null,0,0,0,0,0]
[84,"TRANS. TYP. NO. 4 TO TYP. NO. 7",0,0,0,null,null,null,0,0,0,0,0]
[85,"TRANS. TYP. NO. 4 TO TYP. NO. 8",0,0,0,null,null,null,0,0,0,0,0]
[86,"TRANS. TYP. NO. 4 TO TYP. NO. 9",0,0,0,null,null,null,0,0,0,0,0]
[87,"TRANS. TYP. NO. 4 TO TYP. NO. 10",0,0,0,null,null,null,0,0,0,0,0]
[88,"TRANS. TYP. NO. 4 TO TYP. NO. 11",0,0,0,null,null,null,0,0,0,0,0]
[89,"TRANS. TYP. NO. 4 TO TYP. NO. 12",0,0,0,null,null,null,0,0,0,0,0]
[90,"TRANS. TYP. NO. 4 TO TYP. NO. 13",0,0,0,null,null,null,0,0,0,0,0]
[91,"TRANS. TYP. NO. 4 TO TYP. NO. 14",0,0,0,null,null,null,0,0,0,0,0]
[92,"TRANS. TYP. NO. 4 TO TYP. NO. 15",0,0,0,null,null,null,0,0,0,0,0]
[93,"TRANS. TYP. NO. 4 TO TYP. NO. 16",0,0,0,null,null,null,0,0,0,0,0]
[94,"TRANS. TYP. NO. 4 TO TYP. NO. 17",0,0,0,null,null,null,0,0,0,0,0]
[95,"TRANS. TYP. NO. 4 TO TYP. NO. 18",0,0,0,null,null,null,0,0,0,0,0]
[96,"TRANS. TYP. NO. 4 TO TYP. NO. 19",0,0,0,null,null,null,0,0,0,0,0]
[97,"TRANS. TYP. NO. 4 TO TYP. NO. 20",0,0,0,null,null,null,0,0,0,0,0]
[98,"TRANS. TYP. NO. 5 TO TYP. NO. 1",{"$f":"(C$6+C2)/2","v":178},{"$f":"(D$6+D2)/2","v":36.450000000000003},65.8,null,null,null,1.97,0.32,{"$f":"(K$6+K2)/2","v":200},20,13.5]
[99,"TRANS. TYP. NO. 5 TO TYP. NO. 2",{"$f":"(C$6+C3)/2","v":178},36.35,63.65,null,null,null,1.9650000000000001,0.32,199.5,20,13.5]
[100,"TRANS. TYP. NO. 5 TO TYP. NO. 3",0,0,0,null,null,null,0,0,0,0,0]
[101,"TRANS. TYP. NO. 5 TO TYP. NO. 4",0,0,0,null,null,null,0,0,0,0,0]
[102,"TRANS. TYP. NO. 5 TO TYP. NO. 6",{"$f":"(C$6+C7)/2","v":0},{"$f":"(D$6+D7)/2","v":0},0,null,null,null,0,0,{"$f":"(K$6+K7)/2","v":0},0,0]
[103,"TRANS. TYP. NO. 5 TO TYP. NO. 7",{"$f":"(C$6+C8)/2","v":0},0,0,null,null,null,0,0,0,0,0]
[104,"TRANS. TYP. NO. 5 TO TYP. NO. 8",0,0,0,null,null,null,0,0,0,0,0]
[105,"TRANS. TYP. NO. 5 TO TYP. NO. 9",0,0,0,null,null,null,0,0,0,0,0]
[106,"TRANS. TYP. NO. 5 TO TYP. NO. 10",0,0,0,null,null,null,0,0,0,0,0]
[107,"TRANS. TYP. NO. 5 TO TYP. NO. 11",0,0,0,null,null,null,0,0,0,0,0]
[108,"TRANS. TYP. NO. 5 TO TYP. NO. 12",0,0,0,null,null,null,0,0,0,0,0]
[109,"TRANS. TYP. NO. 5 TO TYP. NO. 13",0,0,0,null,null,null,0,0,0,0,0]
[110,"TRANS. TYP. NO. 5 TO TYP. NO. 14",0,0,0,null,null,null,0,0,0,0,0]
[111,"TRANS. TYP. NO. 5 TO TYP. NO. 15",0,0,0,null,null,null,0,0,0,0,0]
[112,"TRANS. TYP. NO. 5 TO TYP. NO. 16",0,0,0,null,null,null,0,0,0,0,0]
[113,"TRANS. TYP. NO. 5 TO TYP. NO. 17",0,0,0,null,null,null,0,0,0,0,0]
[114,"TRANS. TYP. NO. 5 TO TYP. NO. 18",0,0,0,null,null,null,0,0,0,0,0]
[115,"TRANS. TYP. NO. 5 TO TYP. NO. 19",0,0,0,null,null,null,0,0,0,0,0]
[116,"TRANS. TYP. NO. 5 TO TYP. NO. 20",0,0,0,null,null,null,0,0,0,0,0]
[117,"TRANS. TYP. NO. 6 TO TYP. NO. 1",{"$f":"(C$7+C2)/2","v":178},{"$f":"(D$7+D2)/2","v":36.450000000000003},65.8,null,null,null,1.97,0.32,{"$f":"(K$7+K2)/2","v":200},20,13.5]
[118,"TRANS. TYP. NO. 6 TO TYP. NO. 2",{"$f":"(C$7+C3)/2","v":178},36.35,63.65,null,null,null,1.9650000000000001,0.32,199.5,20,13.5]
[119,"TRANS. TYP. NO. 6 TO TYP. NO. 3",0,0,0,null,null,null,0,0,0,0,0]
[120,"TRANS. TYP. NO. 6 TO TYP. NO. 4",0,0,0,null,null,null,0,0,0,0,0]
[121,"TRANS. TYP. NO. 6 TO TYP. NO. 5",0,0,0,null,null,null,0,0,0,0,0]
[122,"TRANS. TYP. NO. 6 TO TYP. NO. 7",{"$f":"(C$7+C8)/2","v":0},{"$f":"(D$7+D8)/2","v":0},0,null,null,null,0,0,{"$f":"(K$7+K8)/2","v":0},0,0]
[123,"TRANS. TYP. NO. 6 TO TYP. NO. 8",{"$f":"(C$7+C9)/2","v":0},0,0,null,null,null,0,0,0,0,0]
[124,"TRANS. TYP. NO. 6 TO TYP. NO. 9",0,0,0,null,null,null,0,0,0,0,0]
[125,"TRANS. TYP. NO. 6 TO TYP. NO. 10",0,0,0,null,null,null,0,0,0,0,0]
[126,"TRANS. TYP. NO. 6 TO TYP. NO. 11",0,0,0,null,null,null,0,0,0,0,0]
[127,"TRANS. TYP. NO. 6 TO TYP. NO. 12",0,0,0,null,null,null,0,0,0,0,0]
[128,"TRANS. TYP. NO. 6 TO TYP. NO. 13",0,0,0,null,null,null,0,0,0,0,0]
[129,"TRANS. TYP. NO. 6 TO TYP. NO. 14",0,0,0,null,null,null,0,0,0,0,0]
[130,"TRANS. TYP. NO. 6 TO TYP. NO. 15",0,0,0,null,null,null,0,0,0,0,0]
[131,"TRANS. TYP. NO. 6 TO TYP. NO. 16",0,0,0,null,null,null,0,0,0,0,0]
[132,"TRANS. TYP. NO. 6 TO TYP. NO. 17",0,0,0,null,null,null,0,0,0,0,0]
[133,"TRANS. TYP. NO. 6 TO TYP. NO. 18",0,0,0,null,null,null,0,0,0,0,0]
[134,"TRANS. TYP. NO. 6 TO TYP. NO. 19",0,0,0,null,null,null,0,0,0,0,0]
[135,"TRANS. TYP. NO. 6 TO TYP. NO. 20",0,0,0,null,null,null,0,0,0,0,0]
[136,"TRANS. TYP. NO. 7 TO TYP. NO. 1",{"$f":"(C$8+C2)/2","v":178},{"$f":"(D$8+D2)/2","v":36.450000000000003},65.8,null,null,null,1.97,0.32,{"$f":"(K$8+K2)/2","v":200},20,13.5]
[137,"TRANS. TYP. NO. 7 TO TYP. NO. 2",{"$f":"(C$8+C3)/2","v":178},36.35,63.65,null,null,null,1.9650000000000001,0.32,199.5,20,13.5]
[138,"TRANS. TYP. NO. 7 TO TYP. NO. 3",0,0,0,null,null,null,0,0,0,0,0]
[139,"TRANS. TYP. NO. 7 TO TYP. NO. 4",0,0,0,null,null,null,0,0,0,0,0]
[140,"TRANS. TYP. NO. 7 TO TYP. NO. 5",0,0,0,null,null,null,0,0,0,0,0]
[141,"TRANS. TYP. NO. 7 TO TYP. NO. 6",0,0,0,null,null,null,0,0,0,0,0]
[142,"TRANS. TYP. NO. 7 TO TYP. NO. 8",{"$f":"(C$8+C9)/2","v":0},{"$f":"(D$8+D9)/2","v":0},0,null,null,null,0,0,{"$f":"(K$8+K9)/2","v":0},0,0]
[143,"TRANS. TYP. NO. 7 TO TYP. NO. 9",{"$f":"(C$8+C10)/2","v":0},0,0,null,null,null,0,0,0,0,0]
[144,"TRANS. TYP. NO. 7 TO TYP. NO. 10",0,0,0,null,null,null,0,0,0,0,0]
[145,"TRANS. TYP. NO. 7 TO TYP. NO. 11",0,0,0,null,null,null,0,0,0,0,0]
[146,"TRANS. TYP. NO. 7 TO TYP. NO. 12",0,0,0,null,null,null,0,0,0,0,0]
[147,"TRANS. TYP. NO. 7 TO TYP. NO. 13",0,0,0,null,null,null,0,0,0,0,0]
[148,"TRANS. TYP. NO. 7 TO TYP. NO. 14",0,0,0,null,null,null,0,0,0,0,0]
[149,"TRANS. TYP. NO. 7 TO TYP. NO. 15",0,0,0,null,null,null,0,0,0,0,0]
[150,"TRANS. TYP. NO. 7 TO TYP. NO. 16",0,0,0,null,null,null,0,0,0,0,0]
[151,"TRANS. TYP. NO. 7 TO TYP. NO. 17",0,0,0,null,null,null,0,0,0,0,0]
[152,"TRANS. TYP. NO. 7 TO TYP. NO. 18",0,0,0,null,null,null,0,0,0,0,0]
[153,"TRANS. TYP. NO. 7 TO TYP. NO. 19",0,0,0,null,null,null,0,0,0,0,0]
[154,"TRANS. TYP. NO. 7 TO TYP. NO. 20",0,0,0,null,null,null,0,0,0,0,0]
[155,"TRANS. TYP. NO. 8 TO TYP. NO. 1",{"$f":"(C$9+C2)/2","v":178},{"$f":"(D$9+D2)/2","v":36.450000000000003},65.8,null,null,null,1.97,0.32,{"$f":"(K$9+K2)/2","v":200},20,13.5]
[156,"TRANS. TYP. NO. 8 TO TYP. NO. 2",{"$f":"(C$9+C3)/2","v":178},36.35,63.65,null,null,null,1.9650000000000001,0.32,199.5,20,13.5]
[157,"TRANS. TYP. NO. 8 TO TYP. NO. 3",0,0,0,null,null,null,0,0,0,0,0]
[158,"TRANS. TYP. NO. 8 TO TYP. NO. 4",0,0,0,null,null,null,0,0,0,0,0]
[159,"TRANS. TYP. NO. 8 TO TYP. NO. 5",0,0,0,null,null,null,0,0,0,0,0]
[160,"TRANS. TYP. NO. 8 TO TYP. NO. 6",0,0,0,null,null,null,0,0,0,0,0]
[161,"TRANS. TYP. NO. 8 TO TYP. NO. 7",0,0,0,null,null,null,0,0,0,0,0]
[162,"TRANS. TYP. NO. 8 TO TYP. NO. 9",{"$f":"(C$9+C10)/2","v":0},{"$f":"(D$9+D10)/2","v":0},0,null,null,null,0,0,{"$f":"(K$9+K10)/2","v":0},0,0]
[163,"TRANS. TYP. NO. 8 TO TYP. NO. 10",{"$f":"(C$9+C11)/2","v":0},0,0,null,null,null,0,0,0,0,0]
[164,"TRANS. TYP. NO. 8 TO TYP. NO. 11",0,0,0,null,null,null,0,0,0,0,0]
[165,"TRANS. TYP. NO. 8 TO TYP. NO. 12",0,0,0,null,null,null,0,0,0,0,0]
[166,"TRANS. TYP. NO. 8 TO TYP. NO. 13",0,0,0,null,null,null,0,0,0,0,0]
[167,"TRANS. TYP. NO. 8 TO TYP. NO. 14",0,0,0,null,null,null,0,0,0,0,0]
[168,"TRANS. TYP. NO. 8 TO TYP. NO. 15",0,0,0,null,null,null,0,0,0,0,0]
[169,"TRANS. TYP. NO. 8 TO TYP. NO. 16",0,0,0,null,null,null,0,0,0,0,0]
[170,"TRANS. TYP. NO. 8 TO TYP. NO. 17",0,0,0,null,null,null,0,0,0,0,0]
[171,"TRANS. TYP. NO. 8 TO TYP. NO. 18",0,0,0,null,null,null,0,0,0,0,0]
[172,"TRANS. TYP. NO. 8 TO TYP. NO. 19",0,0,0,null,null,null,0,0,0,0,0]
[173,"TRANS. TYP. NO. 8 TO TYP. NO. 20",0,0,0,null,null,null,0,0,0,0,0]
[174,"TRANS. TYP. NO. 9 TO TYP. NO. 1",{"$f":"(C$10+C2)/2","v":178},{"$f":"(D$10+D2)/2","v":36.450000000000003},65.8,null,null,null,1.97,0.32,{"$f":"(K$10+K2)/2","v":200},20,13.5]
[175,"TRANS. TYP. NO. 9 TO TYP. NO. 2",{"$f":"(C$10+C3)/2","v":178},36.35,63.65,null,null,null,1.9650000000000001,0.32,199.5,20,13.5]
[176,"TRANS. TYP. NO. 9 TO TYP. NO. 3",0,0,0,null,null,null,0,0,0,0,0]
[177,"TRANS. TYP. NO. 9 TO TYP. NO. 4",0,0,0,null,null,null,0,0,0,0,0]
[178,"TRANS. TYP. NO. 9 TO TYP. NO. 5",0,0,0,null,null,null,0,0,0,0,0]
[179,"TRANS. TYP. NO. 9 TO TYP. NO. 6",0,0,0,null,null,null,0,0,0,0,0]
[180,"TRANS. TYP. NO. 9 TO TYP. NO. 7",0,0,0,null,null,null,0,0,0,0,0]
[181,"TRANS. TYP. NO. 9 TO TYP. NO. 8",0,0,0,null,null,null,0,0,0,0,0]
[182,"TRANS. TYP. NO. 9 TO TYP. NO. 10",{"$f":"(C$10+C11)/2","v":0},{"$f":"(D$10+D11)/2","v":0},0,null,null,null,0,0,{"$f":"(K$10+K11)/2","v":0},0,0]
[183,"TRANS. TYP. NO. 9 TO TYP. NO. 11",{"$f":"(C$10+C12)/2","v":0},0,0,null,null,null,0,0,0,0,0]
[184,"TRANS. TYP. NO. 9 TO TYP. NO. 12",0,0,0,null,null,null,0,0,0,0,0]
[185,"TRANS. TYP. NO. 9 TO TYP. NO. 13",0,0,0,null,null,null,0,0,0,0,0]
[186,"TRANS. TYP. NO. 9 TO TYP. NO. 14",0,0,0,null,null,null,0,0,0,0,0]
[187,"TRANS. TYP. NO. 9 TO TYP. NO. 15",0,0,0,null,null,null,0,0,0,0,0]
[188,"TRANS. TYP. NO. 9 TO TYP. NO. 16",0,0,0,null,null,null,0,0,0,0,0]
[189,"TRANS. TYP. NO. 9 TO TYP. NO. 17",0,0,0,null,null,null,0,0,0,0,0]
[190,"TRANS. TYP. NO. 9 TO TYP. NO. 18",0,0,0,null,null,null,0,0,0,0,0]
[191,"TRANS. TYP. NO. 9 TO TYP. NO. 19",0,0,0,null,null,null,0,0,0,0,0]
[192,"TRANS. TYP. NO. 9 TO TYP. NO. 20",0,0,0,null,null,null,0,0,0,0,0]
[193,"TRANS. TYP. NO. 10 TO TYP. NO. 1",{"$f":"(C$11+C2)/2","v":178},{"$f":"(D$11+D2)/2","v":36.450000000000003},65.8,null,null,null,1.97,0.32,{"$f":"(K$11+K2)/2","v":200},20,13.5]
[194,"TRANS. TYP. NO. 10 TO TYP. NO. 2",{"$f":"(C$11+C3)/2","v":178},36.35,63.65,null,null,null,1.9650000000000001,0.32,199.5,20,13.5]
[195,"TRANS. TYP. NO. 10 TO TYP. NO. 3",0,0,0,null,null,null,0,0,0,0,0]
[196,"TRANS. TYP. NO. 10 TO TYP. NO. 4",0,0,0,null,null,null,0,0,0,0,0]
[197,"TRANS. TYP. NO. 10 TO TYP. NO. 5",0,0,0,null,null,null,0,0,0,0,0]
[198,"TRANS. TYP. NO. 10 TO TYP. NO. 6",0,0,0,null,null,null,0,0,0,0,0]
[199,"TRANS. TYP. NO. 10 TO TYP. NO. 7",0,0,0,null,null,null,0,0,0,0,0]
[200,"TRANS. TYP. NO. 10 TO TYP. NO. 8",0,0,0,null,null,null,0,0,0,0,0]
[201,"TRANS. TYP. NO. 10 TO TYP. NO. 9",0,0,0,null,null,null,0,0,0,0,0]
[202,"TRANS. TYP. NO. 10 TO TYP. NO. 11",{"$f":"(C$11+C12)/2","v":0},{"$f":"(D$11+D12)/2","v":0},0,null,null,null,0,0,{"$f":"(K$11+K12)/2","v":0},0,0]
[203,"TRANS. TYP. NO. 10 TO TYP. NO. 12",{"$f":"(C$11+C13)/2","v":0},0,0,null,null,null,0,0,0,0,0]
[204,"TRANS. TYP. NO. 10 TO TYP. NO. 13",0,0,0,null,null,null,0,0,0,0,0]
[205,"TRANS. TYP. NO. 10 TO TYP. NO. 14",0,0,0,null,null,null,0,0,0,0,0]
[206,"TRANS. TYP. NO. 10 TO TYP. NO. 15",0,0,0,null,null,null,0,0,0,0,0]
[207,"TRANS. TYP. NO. 10 TO TYP. NO. 16",0,0,0,null,null,null,0,0,0,0,0]
[208,"TRANS. TYP. NO. 10 TO TYP. NO. 17",0,0,0,null,null,null,0,0,0,0,0]
[209,"TRANS. TYP. NO. 10 TO TYP. NO. 18",0,0,0,null,null,null,0,0,0,0,0]
[210,"TRANS. TYP. NO. 10 TO TYP. NO. 19",0,0,0,null,null,null,0,0,0,0,0]
[211,"TRANS. TYP. NO. 10 TO TYP. NO. 20",0,0,0,null,null,null,0,0,0,0,0]
[212,"TRANS. TYP. NO. 11 TO TYP. NO. 1",{"$f":"(C$12+C2)/2","v":178},{"$f":"(D$12+D2)/2","v":36.450000000000003},65.8,null,null,null,1.97,0.32,{"$f":"(K$12+K2)/2","v":200},20,13.5]
[213,"TRANS. TYP. NO. 11 TO TYP. NO. 2",{"$f":"(C$12+C3)/2","v":178},36.35,63.65,null,null,null,1.9650000000000001,0.32,199.5,20,13.5]
[214,"TRANS. TYP. NO. 11 TO TYP. NO. 3",0,0,0,null,null,null,0,0,0,0,0]
[215,"TRANS. TYP. NO. 11 TO TYP. NO. 4",0,0,0,null,null,null,0,0,0,0,0]
[216,"TRANS. TYP. NO. 11 TO TYP. NO. 5",0,0,0,null,null,null,0,0,0,0,0]
[217,"TRANS. TYP. NO. 11 TO TYP. NO. 6",0,0,0,null,null,null,0,0,0,0,0]
[218,"TRANS. TYP. NO. 11 TO TYP. NO. 7",0,0,0,null,null,null,0,0,0,0,0]
[219,"TRANS. TYP. NO. 11 TO TYP. NO. 8",0,0,0,null,null,null,0,0,0,0,0]
[220,"TRANS. TYP. NO. 11 TO TYP. NO. 9",0,0,0,null,null,null,0,0,0,0,0]
[221,"TRANS. TYP. NO. 11 TO TYP. NO. 10",0,0,0,null,null,null,0,0,0,0,0]
[222,"TRANS. TYP. NO. 11 TO TYP. NO. 12",{"$f":"(C$12+C13)/2","v":0},{"$f":"(D$12+D13)/2","v":0},0,null,null,null,0,0,{"$f":"(K$12+K13)/2","v":0},0,0]
[223,"TRANS. TYP. NO. 11 TO TYP. NO. 13",{"$f":"(C$12+C14)/2","v":0},0,0,null,null,null,0,0,0,0,0]
[224,"TRANS. TYP. NO. 11 TO TYP. NO. 14",0,0,0,null,null,null,0,0,0,0,0]
[225,"TRANS. TYP. NO. 11 TO TYP. NO. 15",0,0,0,null,null,null,0,0,0,0,0]
[226,"TRANS. TYP. NO. 11 TO TYP. NO. 16",0,0,0,null,null,null,0,0,0,0,0]
[227,"TRANS. TYP. NO. 11 TO TYP. NO. 17",0,0,0,null,null,null,0,0,0,0,0]
[228,"TRANS. TYP. NO. 11 TO TYP. NO. 18",0,0,0,null,null,null,0,0,0,0,0]
[229,"TRANS. TYP. NO. 11 TO TYP. NO. 19",0,0,0,null,null,null,0,0,0,0,0]
[230,"TRANS. TYP. NO. 11 TO TYP. NO. 20",0,0,0,null,null,null,0,0,0,0,0]
[231,"TRANS. TYP. NO. 12 TO TYP. NO. 1",{"$f":"(C$13+C2)/2","v":178},{"$f":"(D$13+D2)/2","v":36.450000000000003},65.8,null,null,null,1.97,0.32,{"$f":"(K$13+K2)/2","v":200},20,13.5]
[232,"TRANS. TYP. NO. 12 TO TYP. NO. 2",{"$f":"(C$13+C3)/2","v":178},36.35,63.65,null,null,null,1.9650000000000001,0.32,199.5,20,13.5]
[233,"TRANS. TYP. NO. 12 TO TYP. NO. 3",0,0,0,null,null,null,0,0,0,0,0]
[234,"TRANS. TYP. NO. 12 TO TYP. NO. 4",0,0,0,null,null,null,0,0,0,0,0]
[235,"TRANS. TYP. NO. 12 TO TYP. NO. 5",0,0,0,null,null,null,0,0,0,0,0]
[236,"TRANS. TYP. NO. 12 TO TYP. NO. 6",0,0,0,null,null,null,0,0,0,0,0]
[237,"TRANS. TYP. NO. 12 TO TYP. NO. 7",0,0,0,null,null,null,0,0,0,0,0]
[238,"TRANS. TYP. NO. 12 TO TYP. NO. 8",0,0,0,null,null,null,0,0,0,0,0]
[239,"TRANS. TYP. NO. 12 TO TYP. NO. 9",0,0,0,null,null,null,0,0,0,0,0]
[240,"TRANS. TYP. NO. 12 TO TYP. NO. 10",0,0,0,null,null,null,0,0,0,0,0]
[241,"TRANS. TYP. NO. 12 TO TYP. NO. 11",0,0,0,null,null,null,0,0,0,0,0]
[242,"TRANS. TYP. NO. 12 TO TYP. NO. 13",{"$f":"(C$13+C14)/2","v":0},{"$f":"(D$13+D14)/2","v":0},0,null,null,null,0,0,{"$f":"(K$13+K14)/2","v":0},0,0]
[243,"TRANS. TYP. NO. 12 TO TYP. NO. 14",{"$f":"(C$13+C15)/2","v":0},0,0,null,null,null,0,0,0,0,0]
[244,"TRANS. TYP. NO. 12 TO TYP. NO. 15",0,0,0,null,null,null,0,0,0,0,0]
[245,"TRANS. TYP. NO. 12 TO TYP. NO. 16",0,0,0,null,null,null,0,0,0,0,0]
[246,"TRANS. TYP. NO. 12 TO TYP. NO. 17",0,0,0,null,null,null,0,0,0,0,0]
[247,"TRANS. TYP. NO. 12 TO TYP. NO. 18",0,0,0,null,null,null,0,0,0,0,0]
[248,"TRANS. TYP. NO. 12 TO TYP. NO. 19",0,0,0,null,null,null,0,0,0,0,0]
[249,"TRANS. TYP. NO. 12 TO TYP. NO. 20",0,0,0,null,null,null,0,0,0,0,0]
[250,"TRANS. TYP. NO. 13 TO TYP. NO. 1",{"$f":"(C$14+C2)/2","v":178},{"$f":"(D$14+D2)/2","v":36.450000000000003},65.8,null,null,null,1.97,0.32,{"$f":"(K$14+K2)/2","v":200},20,13.5]
[251,"TRANS. TYP. NO. 13 TO TYP. NO. 2",{"$f":"(C$14+C3)/2","v":178},36.35,63.65,null,null,null,1.9650000000000001,0.32,199.5,20,13.5]
[252,"TRANS. TYP. NO. 13 TO TYP. NO. 3",0,0,0,null,null,null,0,0,0,0,0]
[253,"TRANS. TYP. NO. 13 TO TYP. NO. 4",0,0,0,null,null,null,0,0,0,0,0]
[254,"TRANS. TYP. NO. 13 TO TYP. NO. 5",0,0,0,null,null,null,0,0,0,0,0]
[255,"TRANS. TYP. NO. 13 TO TYP. NO. 6",0,0,0,null,null,null,0,0,0,0,0]
[256,"TRANS. TYP. NO. 13 TO TYP. NO. 7",0,0,0,null,null,null,0,0,0,0,0]
[257,"TRANS. TYP. NO. 13 TO TYP. NO. 8",0,0,0,null,null,null,0,0,0,0,0]
[258,"TRANS. TYP. NO. 13 TO TYP. NO. 9",0,0,0,null,null,null,0,0,0,0,0]
[259,"TRANS. TYP. NO. 13 TO TYP. NO. 10",0,0,0,null,null,null,0,0,0,0,0]
[260,"TRANS. TYP. NO. 13 TO TYP. NO. 11",0,0,0,null,null,null,0,0,0,0,0]
[261,"TRANS. TYP. NO. 13 TO TYP. NO. 12",0,0,0,null,null,null,0,0,0,0,0]
[262,"TRANS. TYP. NO. 13 TO TYP. NO. 14",{"$f":"(C$14+C15)/2","v":0},{"$f":"(D$14+D15)/2","v":0},0,null,null,null,0,0,{"$f":"(K$14+K15)/2","v":0},0,0]
[263,"TRANS. TYP. NO. 13 TO TYP. NO. 15",{"$f":"(C$14+C16)/2","v":0},0,0,null,null,null,0,0,0,0,0]
[264,"TRANS. TYP. NO. 13 TO TYP. NO. 16",0,0,0,null,null,null,0,0,0,0,0]
[265,"TRANS. TYP. NO. 13 TO TYP. NO. 17",0,0,0,null,null,null,0,0,0,0,0]
[266,"TRANS. TYP. NO. 13 TO TYP. NO. 18",0,0,0,null,null,null,0,0,0,0,0]
[267,"TRANS. TYP. NO. 13 TO TYP. NO. 19",0,0,0,null,null,null,0,0,0,0,0]
[268,"TRANS. TYP. NO. 13 TO TYP. NO. 20",0,0,0,null,null,null,0,0,0,0,0]
[269,"TRANS. TYP. NO. 14 TO TYP. NO. 1",{"$f":"(C$15+C2)/2","v":178},{"$f":"(D$15+D2)/2","v":36.450000000000003},65.8,null,null,null,1.97,0.32,{"$f":"(K$15+K2)/2","v":200},20,13.5]
[270,"TRANS. TYP. NO. 14 TO TYP. NO. 2",{"$f":"(C$15+C3)/2","v":178},36.35,63.65,null,null,null,1.9650000000000001,0.32,199.5,20,13.5]
[271,"TRANS. TYP. NO. 14 TO TYP. NO. 3",0,0,0,null,null,null,0,0,0,0,0]
[272,"TRANS. TYP. NO. 14 TO TYP. NO. 4",0,0,0,null,null,null,0,0,0,0,0]
[273,"TRANS. TYP. NO. 14 TO TYP. NO. 5",0,0,0,null,null,null,0,0,0,0,0]
[274,"TRANS. TYP. NO. 14 TO TYP. NO. 6",0,0,0,null,null,null,0,0,0,0,0]
[275,"TRANS. TYP. NO. 14 TO TYP. NO. 7",0,0,0,null,null,null,0,0,0,0,0]
[276,"TRANS. TYP. NO. 14 TO TYP. NO. 8",0,0,0,null,null,null,0,0,0,0,0]
[277,"TRANS. TYP. NO. 14 TO TYP. NO. 9",0,0,0,null,null,null,0,0,0,0,0]
[278,"TRANS. TYP. NO. 14 TO TYP. NO. 10",0,0,0,null,null,null,0,0,0,0,0]
[279,"TRANS. TYP. NO. 14 TO TYP. NO. 11",0,0,0,null,null,null,0,0,0,0,0]
[280,"TRANS. TYP. NO. 14 TO TYP. NO. 12",0,0,0,null,null,null,0,0,0,0,0]
[281,"TRANS. TYP. NO. 14 TO TYP. NO. 13",0,0,0,null,null,null,0,0,0,0,0]
[282,"TRANS. TYP. NO. 14 TO TYP. NO. 15",{"$f":"(C$15+C16)/2","v":0},{"$f":"(D$15+D16)/2","v":0},0,null,null,null,0,0,{"$f":"(K$15+K16)/2","v":0},0,0]
[283,"TRANS. TYP. NO. 14 TO TYP. NO. 16",{"$f":"(C$15+C17)/2","v":0},0,0,null,null,null,0,0,0,0,0]
[284,"TRANS. TYP. NO. 14 TO TYP. NO. 17",0,0,0,null,null,null,0,0,0,0,0]
[285,"TRANS. TYP. NO. 14 TO TYP. NO. 18",0,0,0,null,null,null,0,0,0,0,0]
[286,"TRANS. TYP. NO. 14 TO TYP. NO. 19",0,0,0,null,null,null,0,0,0,0,0]
[287,"TRANS. TYP. NO. 14 TO TYP. NO. 20",0,0,0,null,null,null,0,0,0,0,0]
[288,"TRANS. TYP. NO. 15 TO TYP. NO. 1",{"$f":"(C$16+C2)/2","v":178},{"$f":"(D$16+D2)/2","v":36.450000000000003},65.8,null,null,null,1.97,0.32,{"$f":"(K$16+K2)/2","v":200},20,13.5]
[289,"TRANS. TYP. NO. 15 TO TYP. NO. 2",{"$f":"(C$16+C3)/2","v":178},36.35,63.65,null,null,null,1.9650000000000001,0.32,199.5,20,13.5]
[290,"TRANS. TYP. NO. 15 TO TYP. NO. 3",0,0,0,null,null,null,0,0,0,0,0]
[291,"TRANS. TYP. NO. 15 TO TYP. NO. 4",0,0,0,null,null,null,0,0,0,0,0]
[292,"TRANS. TYP. NO. 15 TO TYP. NO. 5",0,0,0,null,null,null,0,0,0,0,0]
[293,"TRANS. TYP. NO. 15 TO TYP. NO. 6",0,0,0,null,null,null,0,0,0,0,0]
[294,"TRANS. TYP. NO. 15 TO TYP. NO. 7",0,0,0,null,null,null,0,0,0,0,0]
[295,"TRANS. TYP. NO. 15 TO TYP. NO. 8",0,0,0,null,null,null,0,0,0,0,0]
[296,"TRANS. TYP. NO. 15 TO TYP. NO. 9",0,0,0,null,null,null,0,0,0,0,0]
[297,"TRANS. TYP. NO. 15 TO TYP. NO. 10",0,0,0,null,null,null,0,0,0,0,0]
[298,"TRANS. TYP. NO. 15 TO TYP. NO. 11",0,0,0,null,null,null,0,0,0,0,0]
[299,"TRANS. TYP. NO. 15 TO TYP. NO. 12",0,0,0,null,null,null,0,0,0,0,0]
[300,"TRANS. TYP. NO. 15 TO TYP. NO. 13",0,0,0,null,null,null,0,0,0,0,0]
[301,"TRANS. TYP. NO. 15 TO TYP. NO. 14",0,0,0,null,null,null,0,0,0,0,0]
[302,"TRANS. TYP. NO. 15 TO TYP. NO. 16",{"$f":"(C$16+C17)/2","v":0},{"$f":"(D$16+D17)/2","v":0},0,null,null,null,0,0,{"$f":"(K$16+K17)/2","v":0},0,0]
[303,"TRANS. TYP. NO. 15 TO TYP. NO. 17",{"$f":"(C$16+C18)/2","v":0},0,0,null,null,null,0,0,0,0,0]
[304,"TRANS. TYP. NO. 15 TO TYP. NO. 18",0,0,0,null,null,null,0,0,0,0,0]
[305,"TRANS. TYP. NO. 15 TO TYP. NO. 19",0,0,0,null,null,null,0,0,0,0,0]
[306,"TRANS. TYP. NO. 15 TO TYP. NO. 20",0,0,0,null,null,null,0,0,0,0,0]
[307,"TRANS. TYP. NO. 16 TO TYP. NO. 1",{"$f":"(C$17+C2)/2","v":178},{"$f":"(D$17+D2)/2","v":36.450000000000003},65.8,null,null,null,1.97,0.32,{"$f":"(K$17+K2)/2","v":200},20,13.5]
[308,"TRANS. TYP. NO. 16 TO TYP. NO. 2",{"$f":"(C$17+C3)/2","v":178},36.35,63.65,null,null,null,1.9650000000000001,0.32,199.5,20,13.5]
[309,"TRANS. TYP. NO. 16 TO TYP. NO. 3",0,0,0,null,null,null,0,0,0,0,0]
[310,"TRANS. TYP. NO. 16 TO TYP. NO. 4",0,0,0,null,null,null,0,0,0,0,0]
[311,"TRANS. TYP. NO. 16 TO TYP. NO. 5",0,0,0,null,null,null,0,0,0,0,0]
[312,"TRANS. TYP. NO. 16 TO TYP. NO. 6",0,0,0,null,null,null,0,0,0,0,0]
[313,"TRANS. TYP. NO. 16 TO TYP. NO. 7",0,0,0,null,null,null,0,0,0,0,0]
[314,"TRANS. TYP. NO. 16 TO TYP. NO. 8",0,0,0,null,null,null,0,0,0,0,0]
[315,"TRANS. TYP. NO. 16 TO TYP. NO. 9",0,0,0,null,null,null,0,0,0,0,0]
[316,"TRANS. TYP. NO. 16 TO TYP. NO. 10",0,0,0,null,null,null,0,0,0,0,0]
[317,"TRANS. TYP. NO. 16 TO TYP. NO. 11",0,0,0,null,null,null,0,0,0,0,0]
[318,"TRANS. TYP. NO. 16 TO TYP. NO. 12",0,0,0,null,null,null,0,0,0,0,0]
[319,"TRANS. TYP. NO. 16 TO TYP. NO. 13",0,0,0,null,null,null,0,0,0,0,0]
[320,"TRANS. TYP. NO. 16 TO TYP. NO. 14",0,0,0,null,null,null,0,0,0,0,0]
[321,"TRANS. TYP. NO. 16 TO TYP. NO. 15",0,0,0,null,null,null,0,0,0,0,0]
[322,"TRANS. TYP. NO. 16 TO TYP. NO. 17",{"$f":"(C$17+C18)/2","v":0},{"$f":"(D$17+D18)/2","v":0},0,null,null,null,0,0,{"$f":"(K$17+K18)/2","v":0},0,0]
[323,"TRANS. TYP. NO. 16 TO TYP. NO. 18",{"$f":"(C$17+C19)/2","v":0},0,0,null,null,null,0,0,0,0,0]
[324,"TRANS. TYP. NO. 16 TO TYP. NO. 19",0,0,0,null,null,null,0,0,0,0,0]
[325,"TRANS. TYP. NO. 16 TO TYP. NO. 20",0,0,0,null,null,null,0,0,0,0,0]
[326,"TRANS. TYP. NO. 17 TO TYP. NO. 1",{"$f":"(C$18+C2)/2","v":178},{"$f":"(D$18+D2)/2","v":36.450000000000003},65.8,null,null,null,1.97,0.32,{"$f":"(K$18+K2)/2","v":200},20,13.5]
[327,"TRANS. TYP. NO. 17 TO TYP. NO. 2",{"$f":"(C$18+C3)/2","v":178},36.35,63.65,null,null,null,1.9650000000000001,0.32,199.5,20,13.5]
[328,"TRANS. TYP. NO. 17 TO TYP. NO. 3",0,0,0,null,null,null,0,0,0,0,0]
[329,"TRANS. TYP. NO. 17 TO TYP. NO. 4",0,0,0,null,null,null,0,0,0,0,0]
[330,"TRANS. TYP. NO. 17 TO TYP. NO. 5",0,0,0,null,null,null,0,0,0,0,0]
[331,"TRANS. TYP. NO. 17 TO TYP. NO. 6",0,0,0,null,null,null,0,0,0,0,0]
[332,"TRANS. TYP. NO. 17 TO TYP. NO. 7",0,0,0,null,null,null,0,0,0,0,0]
[333,"TRANS. TYP. NO. 17 TO TYP. NO. 8",0,0,0,null,null,null,0,0,0,0,0]
[334,"TRANS. TYP. NO. 17 TO TYP. NO. 9",0,0,0,null,null,null,0,0,0,0,0]
[335,"TRANS. TYP. NO. 17 TO TYP. NO. 10",0,0,0,null,null,null,0,0,0,0,0]
[336,"TRANS. TYP. NO. 17 TO TYP. NO. 11",0,0,0,null,null,null,0,0,0,0,0]
[337,"TRANS. TYP. NO. 17 TO TYP. NO. 12",0,0,0,null,null,null,0,0,0,0,0]
[338,"TRANS. TYP. NO. 17 TO TYP. NO. 13",0,0,0,null,null,null,0,0,0,0,0]
[339,"TRANS. TYP. NO. 17 TO TYP. NO. 14",0,0,0,null,null,null,0,0,0,0,0]
[340,"TRANS. TYP. NO. 17 TO TYP. NO. 15",0,0,0,null,null,null,0,0,0,0,0]
[341,"TRANS. TYP. NO. 17 TO TYP. NO. 16",0,0,0,null,null,null,0,0,0,0,0]
[342,"TRANS. TYP. NO. 17 TO TYP. NO. 18",{"$f":"(C$18+C19)/2","v":0},{"$f":"(D$18+D19)/2","v":0},0,null,null,null,0,0,{"$f":"(K$18+K19)/2","v":0},0,0]
[343,"TRANS. TYP. NO. 17 TO TYP. NO. 19",{"$f":"(C$18+C20)/2","v":0},0,0,null,null,null,0,0,0,0,0]
[344,"TRANS. TYP. NO. 17 TO TYP. NO. 20",0,0,0,null,null,null,0,0,0,0,0]
[345,"TRANS. TYP. NO. 18 TO TYP. NO. 1",{"$f":"(C$19+C2)/2","v":178},{"$f":"(D$19+D2)/2","v":36.450000000000003},65.8,null,null,null,1.97,0.32,{"$f":"(K$19+K2)/2","v":200},20,13.5]
[346,"TRANS. TYP. NO. 18 TO TYP. NO. 2",{"$f":"(C$19+C3)/2","v":178},36.35,63.65,null,null,null,1.9650000000000001,0.32,199.5,20,13.5]
[347,"TRANS. TYP. NO. 18 TO TYP. NO. 3",0,0,0,null,null,null,0,0,0,0,0]
[348,"TRANS. TYP. NO. 18 TO TYP. NO. 4",0,0,0,null,null,null,0,0,0,0,0]
[349,"TRANS. TYP. NO. 18 TO TYP. NO. 5",0,0,0,null,null,null,0,0,0,0,0]
[350,"TRANS. TYP. NO. 18 TO TYP. NO. 6",0,0,0,null,null,null,0,0,0,0,0]
[351,"TRANS. TYP. NO. 18 TO TYP. NO. 7",0,0,0,null,null,null,0,0,0,0,0]
[352,"TRANS. TYP. NO. 18 TO TYP. NO. 8",0,0,0,null,null,null,0,0,0,0,0]
[353,"TRANS. TYP. NO. 18 TO TYP. NO. 9",0,0,0,null,null,null,0,0,0,0,0]
[354,"TRANS. TYP. NO. 18 TO TYP. NO. 10",0,0,0,null,null,null,0,0,0,0,0]
[355,"TRANS. TYP. NO. 18 TO TYP. NO. 11",0,0,0,null,null,null,0,0,0,0,0]
[356,"TRANS. TYP. NO. 18 TO TYP. NO. 12",0,0,0,null,null,null,0,0,0,0,0]
[357,"TRANS. TYP. NO. 18 TO TYP. NO. 13",0,0,0,null,null,null,0,0,0,0,0]
[358,"TRANS. TYP. NO. 18 TO TYP. NO. 14",0,0,0,null,null,null,0,0,0,0,0]
[359,"TRANS. TYP. NO. 18 TO TYP. NO. 15",0,0,0,null,null,null,0,0,0,0,0]
[360,"TRANS. TYP. NO. 18 TO TYP. NO. 16",0,0,0,null,null,null,0,0,0,0,0]
[361,"TRANS. TYP. NO. 18 TO TYP. NO. 17",0,0,0,null,null,null,0,0,0,0,0]
[362,"TRANS. TYP. NO. 18 TO TYP. NO. 19",{"$f":"(C$19+C20)/2","v":0},{"$f":"(D$19+D20)/2","v":0},0,null,null,null,0,0,{"$f":"(K$19+K20)/2","v":0},0,0]
[363,"TRANS. TYP. NO. 18 TO TYP. NO. 20",{"$f":"(C$19+C21)/2","v":0},{"$f":"(D$19+D21)/2","v":0},0,null,null,null,0,0,0,0,0]
[364,"TRANS. TYP. NO. 19 TO TYP. NO. 1",{"$f":"(C$20+C2)/2","v":178},{"$f":"(D$20+D2)/2","v":36.450000000000003},65.8,null,null,null,1.97,0.32,{"$f":"(K$20+K2)/2","v":200},20,13.5]
[365,"TRANS. TYP. NO. 19 TO TYP. NO. 2",{"$f":"(C$20+C3)/2","v":178},36.35,63.65,null,null,null,1.9650000000000001,0.32,199.5,20,13.5]
[366,"TRANS. TYP. NO. 19 TO TYP. NO. 3",0,0,0,null,null,null,0,0,0,0,0]
[367,"TRANS. TYP. NO. 19 TO TYP. NO. 4",0,0,0,null,null,null,0,0,0,0,0]
[368,"TRANS. TYP. NO. 19 TO TYP. NO. 5",0,0,0,null,null,null,0,0,0,0,0]
[369,"TRANS. TYP. NO. 19 TO TYP. NO. 6",0,0,0,null,null,null,0,0,0,0,0]
[370,"TRANS. TYP. NO. 19 TO TYP. NO. 7",0,0,0,null,null,null,0,0,0,0,0]
[371,"TRANS. TYP. NO. 19 TO TYP. NO. 8",0,0,0,null,null,null,0,0,0,0,0]
[372,"TRANS. TYP. NO. 19 TO TYP. NO. 9",0,0,0,null,null,null,0,0,0,0,0]
[373,"TRANS. TYP. NO. 19 TO TYP. NO. 10",0,0,0,null,null,null,0,0,0,0,0]
[374,"TRANS. TYP. NO. 19 TO TYP. NO. 11",0,0,0,null,null,null,0,0,0,0,0]
[375,"TRANS. TYP. NO. 19 TO TYP. NO. 12",0,0,0,null,null,null,0,0,0,0,0]
[376,"TRANS. TYP. NO. 19 TO TYP. NO. 13",0,0,0,null,null,null,0,0,0,0,0]
[377,"TRANS. TYP. NO. 19 TO TYP. NO. 14",0,0,0,null,null,null,0,0,0,0,0]
[378,"TRANS. TYP. NO. 19 TO TYP. NO. 15",0,0,0,null,null,null,0,0,0,0,0]
[379,"TRANS. TYP. NO. 19 TO TYP. NO. 16",0,0,0,null,null,null,0,0,0,0,0]
[380,"TRANS. TYP. NO. 19 TO TYP. NO. 17",0,0,0,null,null,null,0,0,0,0,0]
[381,"TRANS. TYP. NO. 19 TO TYP. NO. 18",0,0,0,null,null,null,0,0,0,0,0]
[382,"TRANS. TYP. NO. 19 TO TYP. NO. 20",{"$f":"(C$20+C21)/2","v":0},{"$f":"(D$20+D21)/2","v":0},0,null,null,null,0,0,{"$f":"(K$20+K21)/2","v":0},{"$f":"(L$20+L21)/2","v":0},{"$f":"(M$20+M21)/2","v":0}]
[383,"TRANS. TYP. NO. 20 TO TYP. NO. 1",{"$f":"(C$21+C2)/2","v":178},{"$f":"('Typical Section Quantities'!C138+'Typical Section Quantities'!C5)/2","v":36.450000000000003},{"$f":"('Typical Section Quantities'!D137+'Typical Section Quantities'!D4)/2","v":65.8},null,null,null,{"$f":"('Typical Section Quantities'!F137+'Typical Section Quantities'!F4)/2","v":1.97},{"$f":"('Typical Section Quantities'!G137+'Typical Section Quantities'!G4)/2","v":0.32},{"$f":"('Typical Section Quantities'!H136+'Typical Section Quantities'!H3)/2","v":200},null,{"$f":"('Typical Section Quantities'!J138+'Typical Section Quantities'!J5)/2","v":13.5}]
[384,"TRANS. TYP. NO. 20 TO TYP. NO. 2",{"$f":"(C$21+C3)/2","v":178},{"$f":"('Typical Section Quantities'!C138+'Typical Section Quantities'!C12)/2","v":36.35},{"$f":"('Typical Section Quantities'!D137+'Typical Section Quantities'!D11)/2","v":63.65},null,null,null,{"$f":"('Typical Section Quantities'!F137+'Typical Section Quantities'!F11)/2","v":1.9650000000000001},{"$f":"('Typical Section Quantities'!G137+'Typical Section Quantities'!G11)/2","v":0.32},{"$f":"('Typical Section Quantities'!H136+'Typical Section Quantities'!H10)/2","v":199.5},null,{"$f":"('Typical Section Quantities'!J138+'Typical Section Quantities'!J12)/2","v":13.5}]
[385,"TRANS. TYP. NO. 20 TO TYP. NO. 3",0,{"$f":"('Typical Section Quantities'!C138+'Typical Section Quantities'!C19)/2","v":0},{"$f":"('Typical Section Quantities'!D137+'Typical Section Quantities'!D18)/2","v":0},null,null,null,{"$f":"('Typical Section Quantities'!F137+'Typical Section Quantities'!F18)/2","v":0},{"$f":"('Typical Section Quantities'!G137+'Typical Section Quantities'!G18)/2","v":0},{"$f":"('Typical Section Quantities'!H136+'Typical Section Quantities'!H17)/2","v":0},null,{"$f":"('Typical Section Quantities'!J138+'Typical Section Quantities'!J19)/2","v":0}]
[386,"TRANS. TYP. NO. 20 TO TYP. NO. 4",0,{"$f":"('Typical Section Quantities'!C138+'Typical Section Quantities'!C26)/2","v":0},{"$f":"('Typical Section Quantities'!D137+'Typical Section Quantities'!D25)/2","v":0},null,null,null,{"$f":"('Typical Section Quantities'!F137+'Typical Section Quantities'!F25)/2","v":0},{"$f":"('Typical Section Quantities'!G137+'Typical Section Quantities'!G25)/2","v":0},{"$f":"('Typical Section Quantities'!H136+'Typical Section Quantities'!H24)/2","v":0},null,{"$f":"('Typical Section Quantities'!J138+'Typical Section Quantities'!J26)/2","v":0}]
[387,"TRANS. TYP. NO. 20 TO TYP. NO. 5",0,{"$f":"('Typical Section Quantities'!C138+'Typical Section Quantities'!C33)/2","v":0},{"$f":"('Typical Section Quantities'!D137+'Typical Section Quantities'!D32)/2","v":0},null,null,null,{"$f":"('Typical Section Quantities'!F137+'Typical Section Quantities'!F32)/2","v":0},{"$f":"('Typical Section Quantities'!G137+'Typical Section Quantities'!G32)/2","v":0},{"$f":"('Typical Section Quantities'!H136+'Typical Section Quantities'!H31)/2","v":0},null,{"$f":"('Typical Section Quantities'!J138+'Typical Section Quantities'!J33)/2","v":0}]
[388,"TRANS. TYP. NO. 20 TO TYP. NO. 6",0,{"$f":"('Typical Section Quantities'!C138+'Typical Section Quantities'!C40)/2","v":0},{"$f":"('Typical Section Quantities'!D137+'Typical Section Quantities'!D39)/2","v":0},null,null,null,{"$f":"('Typical Section Quantities'!F137+'Typical Section Quantities'!F39)/2","v":0},{"$f":"('Typical Section Quantities'!G137+'Typical Section Quantities'!G39)/2","v":0},{"$f":"('Typical Section Quantities'!H136+'Typical Section Quantities'!H38)/2","v":0},null,{"$f":"('Typical Section Quantities'!J138+'Typical Section Quantities'!J40)/2","v":0}]
[389,"TRANS. TYP. NO. 20 TO TYP. NO. 7",0,{"$f":"('Typical Section Quantities'!C138+'Typical Section Quantities'!C47)/2","v":0},{"$f":"('Typical Section Quantities'!D137+'Typical Section Quantities'!D46)/2","v":0},null,null,null,{"$f":"('Typical Section Quantities'!F137+'Typical Section Quantities'!F46)/2","v":0},{"$f":"('Typical Section Quantities'!G137+'Typical Section Quantities'!G46)/2","v":0},{"$f":"('Typical Section Quantities'!H136+'Typical Section Quantities'!H45)/2","v":0},null,{"$f":"('Typical Section Quantities'!J138+'Typical Section Quantities'!J47)/2","v":0}]
[390,"TRANS. TYP. NO. 20 TO TYP. NO. 8",0,{"$f":"('Typical Section Quantities'!C138+'Typical Section Quantities'!C54)/2","v":0},{"$f":"('Typical Section Quantities'!D137+'Typical Section Quantities'!D53)/2","v":0},null,null,null,{"$f":"('Typical Section Quantities'!F137+'Typical Section Quantities'!F53)/2","v":0},{"$f":"('Typical Section Quantities'!G137+'Typical Section Quantities'!G53)/2","v":0},{"$f":"('Typical Section Quantities'!H136+'Typical Section Quantities'!H52)/2","v":0},null,{"$f":"('Typical Section Quantities'!J138+'Typical Section Quantities'!J54)/2","v":0}]
[391,"TRANS. TYP. NO. 20 TO TYP. NO. 9",0,{"$f":"('Typical Section Quantities'!C138+'Typical Section Quantities'!C61)/2","v":0},{"$f":"('Typical Section Quantities'!D137+'Typical Section Quantities'!D60)/2","v":0},null,null,null,{"$f":"('Typical Section Quantities'!F137+'Typical Section Quantities'!F60)/2","v":0},{"$f":"('Typical Section Quantities'!G137+'Typical Section Quantities'!G60)/2","v":0},{"$f":"('Typical Section Quantities'!H136+'Typical Section Quantities'!H59)/2","v":0},null,{"$f":"('Typical Section Quantities'!J138+'Typical Section Quantities'!J61)/2","v":0}]
[392,"TRANS. TYP. NO. 20 TO TYP. NO. 10",0,{"$f":"('Typical Section Quantities'!C138+'Typical Section Quantities'!C68)/2","v":0},{"$f":"('Typical Section Quantities'!D137+'Typical Section Quantities'!D67)/2","v":0},null,null,null,{"$f":"('Typical Section Quantities'!F137+'Typical Section Quantities'!F67)/2","v":0},{"$f":"('Typical Section Quantities'!G137+'Typical Section Quantities'!G67)/2","v":0},{"$f":"('Typical Section Quantities'!H136+'Typical Section Quantities'!H66)/2","v":0},null,{"$f":"('Typical Section Quantities'!J138+'Typical Section Quantities'!J68)/2","v":0}]
[393,"TRANS. TYP. NO. 20 TO TYP. NO. 11",0,{"$f":"('Typical Section Quantities'!C138+'Typical Section Quantities'!C75)/2","v":0},{"$f":"('Typical Section Quantities'!D137+'Typical Section Quantities'!D74)/2","v":0},null,null,null,{"$f":"('Typical Section Quantities'!F137+'Typical Section Quantities'!F74)/2","v":0},{"$f":"('Typical Section Quantities'!G137+'Typical Section Quantities'!G74)/2","v":0},{"$f":"('Typical Section Quantities'!H136+'Typical Section Quantities'!H73)/2","v":0},null,{"$f":"('Typical Section Quantities'!J138+'Typical Section Quantities'!J75)/2","v":0}]
[394,"TRANS. TYP. NO. 20 TO TYP. NO. 12",0,{"$f":"('Typical Section Quantities'!C138+'Typical Section Quantities'!C82)/2","v":0},{"$f":"('Typical Section Quantities'!D137+'Typical Section Quantities'!D81)/2","v":0},null,null,null,{"$f":"('Typical Section Quantities'!F137+'Typical Section Quantities'!F81)/2","v":0},{"$f":"('Typical Section Quantities'!G137+'Typical Section Quantities'!G81)/2","v":0},{"$f":"('Typical Section Quantities'!H136+'Typical Section Quantities'!H80)/2","v":0},null,{"$f":"('Typical Section Quantities'!J138+'Typical Section Quantities'!J82)/2","v":0}]
[395,"TRANS. TYP. NO. 20 TO TYP. NO. 13",0,{"$f":"('Typical Section Quantities'!C138+'Typical Section Quantities'!C89)/2","v":0},{"$f":"('Typical Section Quantities'!D137+'Typical Section Quantities'!D88)/2","v":0},null,null,null,{"$f":"('Typical Section Quantities'!F137+'Typical Section Quantities'!F88)/2","v":0},{"$f":"('Typical Section Quantities'!G137+'Typical Section Quantities'!G88)/2","v":0},{"$f":"('Typical Section Quantities'!H136+'Typical Section Quantities'!H87)/2","v":0},null,{"$f":"('Typical Section Quantities'!J138+'Typical Section Quantities'!J89)/2","v":0}]
[396,"TRANS. TYP. NO. 20 TO TYP. NO. 14",0,{"$f":"('Typical Section Quantities'!C138+'Typical Section Quantities'!C96)/2","v":0},{"$f":"('Typical Section Quantities'!D137+'Typical Section Quantities'!D95)/2","v":0},null,null,null,{"$f":"('Typical Section Quantities'!F137+'Typical Section Quantities'!F95)/2","v":0},{"$f":"('Typical Section Quantities'!G137+'Typical Section Quantities'!G95)/2","v":0},{"$f":"('Typical Section Quantities'!H136+'Typical Section Quantities'!H94)/2","v":0},null,{"$f":"('Typical Section Quantities'!J138+'Typical Section Quantities'!J96)/2","v":0}]
[397,"TRANS. TYP. NO. 20 TO TYP. NO. 15",0,{"$f":"('Typical Section Quantities'!C138+'Typical Section Quantities'!C103)/2","v":0},{"$f":"('Typical Section Quantities'!D137+'Typical Section Quantities'!D102)/2","v":0},null,null,null,{"$f":"('Typical Section Quantities'!F137+'Typical Section Quantities'!F102)/2","v":0},{"$f":"('Typical Section Quantities'!G137+'Typical Section Quantities'!G102)/2","v":0},{"$f":"('Typical Section Quantities'!H136+'Typical Section Quantities'!H101)/2","v":0},null,{"$f":"('Typical Section Quantities'!J138+'Typical Section Quantities'!J103)/2","v":0}]
[398,"TRANS. TYP. NO. 20 TO TYP. NO. 16",0,{"$f":"('Typical Section Quantities'!C138+'Typical Section Quantities'!C110)/2","v":0},{"$f":"('Typical Section Quantities'!D137+'Typical Section Quantities'!D109)/2","v":0},null,null,null,{"$f":"('Typical Section Quantities'!F137+'Typical Section Quantities'!F109)/2","v":0},{"$f":"('Typical Section Quantities'!G137+'Typical Section Quantities'!G109)/2","v":0},{"$f":"('Typical Section Quantities'!H136+'Typical Section Quantities'!H108)/2","v":0},null,{"$f":"('Typical Section Quantities'!J138+'Typical Section Quantities'!J110)/2","v":0}]
[399,"TRANS. TYP. NO. 20 TO TYP. NO. 17",0,{"$f":"('Typical Section Quantities'!C138+'Typical Section Quantities'!C117)/2","v":0},{"$f":"('Typical Section Quantities'!D137+'Typical Section Quantities'!D116)/2","v":0},null,null,null,{"$f":"('Typical Section Quantities'!F137+'Typical Section Quantities'!F116)/2","v":0},{"$f":"('Typical Section Quantities'!G137+'Typical Section Quantities'!G116)/2","v":0},{"$f":"('Typical Section Quantities'!H136+'Typical Section Quantities'!H115)/2","v":0},null,{"$f":"('Typical Section Quantities'!J138+'Typical Section Quantities'!J117)/2","v":0}]
[400,"TRANS. TYP. NO. 20 TO TYP. NO. 18",0,{"$f":"('Typical Section Quantities'!C138+'Typical Section Quantities'!C124)/2","v":0},{"$f":"('Typical Section Quantities'!D137+'Typical Section Quantities'!D123)/2","v":0},null,null,null,{"$f":"('Typical Section Quantities'!F137+'Typical Section Quantities'!F123)/2","v":0},{"$f":"('Typical Section Quantities'!G137+'Typical Section Quantities'!G123)/2","v":0},{"$f":"('Typical Section Quantities'!H136+'Typical Section Quantities'!H122)/2","v":0},null,{"$f":"('Typical Section Quantities'!J138+'Typical Section Quantities'!J124)/2","v":0}]
[401,"TRANS. TYP. NO. 20 TO TYP. NO. 19",0,{"$f":"('Typical Section Quantities'!C138+'Typical Section Quantities'!C131)/2","v":0},{"$f":"('Typical Section Quantities'!D137+'Typical Section Quantities'!D130)/2","v":0},null,null,null,{"$f":"('Typical Section Quantities'!F137+'Typical Section Quantities'!F130)/2","v":0},{"$f":"('Typical Section Quantities'!G137+'Typical Section Quantities'!G130)/2","v":0},{"$f":"('Typical Section Quantities'!H136+'Typical Section Quantities'!H129)/2","v":0},null,{"$f":"('Typical Section Quantities'!J138+'Typical Section Quantities'!J131)/2","v":0}]
[402,null,"ERROR","ERROR","ERROR","ERROR","ERROR","ERROR","ERROR","ERROR","ERROR","ERROR","ERROR"]